BDBM128020 US8796310, 1V
SMILES: CC(C)c1ccnc(Nc2cc(C)cc(n2)-c2cnc(s2)C2(O)CCCc3cc(ccc23)C(O)=O)c1
InChI Key: InChIKey=KKTVBURDGTYPDU-UHFFFAOYSA-N
Data: 1 IC50
Activity Spreadsheet -- Enzyme Inhibition Constant Data from BindingDB
Found 1 hit for monomerid = 128020
Trg + Lig
Ki
nM
ΔG°
kcal/mole
IC50
nM
Kd
nM
EC50/IC50
nM
koff
s-1
kon
M-1s-1
pHTemp
°C
Tyrosine-protein kinase SYK
(Homo sapiens (Human))
BDBM128020
(US8796310, 1V)
Show SMILES CC(C)c1ccnc(Nc2cc(C)cc(n2)-c2cnc(s2)C2(O)CCCc3cc(ccc23)C(O)=O)c1
Show InChI InChI=1S/C28H28N4O3S/c1-16(2)18-8-10-29-24(14-18)32-25-12-17(3)11-22(31-25)23-15-30-27(36-23)28(35)9-4-5-19-13-20(26(33)34)6-7-21(19)28/h6-8,10-16,35H,4-5,9H2,1-3H3,(H,33,34)(H,29,31,32)
NCI pathway
Reactome pathway
US Patent
n/an/a<0.5n/an/an/an/a7.5n/a
Merck Sharp & Dohme Corp.
US Patent
Assay Description
A recombinant GST-hSyk fusion protein was used to measure potency of compounds to inhibit human Syk activity. The recombinant human GST-Syk (Cama Bio...
US Patent US8796310 (2014)
BindingDB Entry DOI: 10.7270/Q29W0D61