BDBM128304 US8796284, 24
SMILES: CNc1nc(nc(N)c1Br)-n1cccn1
InChI Key: InChIKey=HCOMUGNFBLXSBR-UHFFFAOYSA-N
Data: 1 KI
Activity Spreadsheet -- Enzyme Inhibition Constant Data from BindingDB
Found 1 hit for monomerid = 128304
Trg + Lig
Ki
nM
ΔG°
kcal/mole
IC50
nM
Kd
nM
EC50/IC50
nM
koff
s-1
kon
M-1s-1
pHTemp
°C
Adenosine receptor A2a
(Homo sapiens (Human))
BDBM128304
(US8796284, 24)
Show SMILES CNc1nc(nc(N)c1Br)-n1cccn1
Show InChI InChI=1S/C8H9BrN6/c1-11-7-5(9)6(10)13-8(14-7)15-4-2-3-12-15/h2-4H,1H3,(H3,10,11,13,14)
NCI pathway
Reactome pathway
US Patent
16 -10.6n/an/an/an/an/an/a25
Palobiofarma, S.L.
US Patent
Assay Description
Competition assays were carried out by incubation of membranes from hA1 receptors transfected to CHO cells, [3H]-DPCPX as radioligand, buffer (HEPES ...
US Patent US8796284 (2014)
BindingDB Entry DOI: 10.7270/Q2WM1C2Q