null
SMILES: O=C(C1CC1)N1CC[C@@H](Cc2n[nH]c(=O)n2-c2ccc(cc2)-c2ccc3OCOc3c2)C1
InChI Key: InChIKey=IJSKDJVOKJTYAV-HNNXBMFYSA-N
Activity Spreadsheet -- Enzyme Inhibition Constant Data from BindingDB
Found 1 hit for monomerid = 128361
Trg + Lig
Ki
nM
ΔG°
kcal/mole
IC50
nM
Kd
nM
EC50/IC50
nM
koff
s-1
kon
M-1s-1
pHTemp
°C
Fatty acid synthase
(Homo sapiens (Human))
BDBM128361
(US8802864, 38)
Show SMILES O=C(C1CC1)N1CC[C@@H](Cc2n[nH]c(=O)n2-c2ccc(cc2)-c2ccc3OCOc3c2)C1 |r|
Show InChI InChI=1S/C24H24N4O4/c29-23(17-1-2-17)27-10-9-15(13-27)11-22-25-26-24(30)28(22)19-6-3-16(4-7-19)18-5-8-20-21(12-18)32-14-31-20/h3-8,12,15,17H,1-2,9-11,13-14H2,(H,26,30)/t15-/m0/s1
US Patent
n/an/a 158n/an/an/an/a7.0n/a
GlaxoSmithKline LLC
US Patent
Assay Description
Assay #1:Inhibition of FAS activity can be measured based on the detection of residual NADPH substrate after the FAS assay is quenched. This assay is...
US Patent US8802864 (2014)
BindingDB Entry DOI: 10.7270/Q2N58K26