BDBM128443 US8796244, 22
SMILES: FC(F)(F)CNC(=O)Nc1cccc(c1)-c1cnc2cc(ccn12)-c1nnc(CCN2CCCCC2)s1
InChI Key: InChIKey=FVBYZAPHBUXFOH-UHFFFAOYSA-N
Data: 2 IC50
Activity Spreadsheet -- Enzyme Inhibition Constant Data from BindingDB
Found 2 hits for monomerid = 128443
Trg + Lig
Ki
nM
ΔG°
kcal/mole
IC50
nM
Kd
nM
EC50/IC50
nM
koff
s-1
kon
M-1s-1
pHTemp
°C
Vascular endothelial growth factor receptor 2
(Homo sapiens (Human))
BDBM128443
(US8796244, 22)
Show SMILES FC(F)(F)CNC(=O)Nc1cccc(c1)-c1cnc2cc(ccn12)-c1nnc(CCN2CCCCC2)s1
Show InChI InChI=1S/C25H26F3N7OS/c26-25(27,28)16-30-24(36)31-19-6-4-5-17(13-19)20-15-29-21-14-18(7-12-35(20)21)23-33-32-22(37-23)8-11-34-9-2-1-3-10-34/h4-7,12-15H,1-3,8-11,16H2,(H2,30,31,36)
NCI pathway
Reactome pathway
US Patent
n/an/a 7.85n/an/an/an/a8.025
Astex Therapeutics Ltd
US Patent
Assay Description
VEGFR2 (from Upstate), prepared at 2x final concentration, was incubated with test compounds, biotinylated Flt3 substrate (biotin-VASSDNEYFYVDF) (Cel...
US Patent US8796244 (2014)
BindingDB Entry DOI: 10.7270/Q20C4TFP
Fibroblast growth factor receptor 3
(Homo sapiens (Human))
BDBM128443
(US8796244, 22)
Show SMILES FC(F)(F)CNC(=O)Nc1cccc(c1)-c1cnc2cc(ccn12)-c1nnc(CCN2CCCCC2)s1
Show InChI InChI=1S/C25H26F3N7OS/c26-25(27,28)16-30-24(36)31-19-6-4-5-17(13-19)20-15-29-21-14-18(7-12-35(20)21)23-33-32-22(37-23)8-11-34-9-2-1-3-10-34/h4-7,12-15H,1-3,8-11,16H2,(H2,30,31,36)
Reactome pathway
US Patent
n/an/a 0.704n/an/an/an/a8.025
Astex Therapeutics Ltd
US Patent
Assay Description
Enzymes (from Upstate) were prepared at 2× final concentration in 1× kinase assay buffer (Table 1). Enzymes were then incubated with test compounds, ...
US Patent US8796244 (2014)
BindingDB Entry DOI: 10.7270/Q20C4TFP