BDBM128501 US8796244, 80
SMILES: COCCNc1ccc(nn1)-c1ccn2c(cnc2c1)-c1cccc(NC(=O)NCC(F)(F)F)c1
InChI Key: InChIKey=AEQRLIJNBCKCJO-UHFFFAOYSA-N
Data: 2 IC50
Activity Spreadsheet -- Enzyme Inhibition Constant Data from BindingDB
Found 2 hits for monomerid = 128501
Trg + Lig
Ki
nM
ΔG°
kcal/mole
IC50
nM
Kd
nM
EC50/IC50
nM
koff
s-1
kon
M-1s-1
pHTemp
°C
Vascular endothelial growth factor receptor 2
(Homo sapiens (Human))
BDBM128501
(US8796244, 80)
Show SMILES COCCNc1ccc(nn1)-c1ccn2c(cnc2c1)-c1cccc(NC(=O)NCC(F)(F)F)c1
Show InChI InChI=1S/C23H22F3N7O2/c1-35-10-8-27-20-6-5-18(31-32-20)15-7-9-33-19(13-28-21(33)12-15)16-3-2-4-17(11-16)30-22(34)29-14-23(24,25)26/h2-7,9,11-13H,8,10,14H2,1H3,(H,27,32)(H2,29,30,34)
NCI pathway
Reactome pathway
US Patent
n/an/a 17.7n/an/an/an/a8.025
Astex Therapeutics Ltd
US Patent
Assay Description
VEGFR2 (from Upstate), prepared at 2x final concentration, was incubated with test compounds, biotinylated Flt3 substrate (biotin-VASSDNEYFYVDF) (Cel...
US Patent US8796244 (2014)
BindingDB Entry DOI: 10.7270/Q20C4TFP
Fibroblast growth factor receptor 3
(Homo sapiens (Human))
BDBM128501
(US8796244, 80)
Show SMILES COCCNc1ccc(nn1)-c1ccn2c(cnc2c1)-c1cccc(NC(=O)NCC(F)(F)F)c1
Show InChI InChI=1S/C23H22F3N7O2/c1-35-10-8-27-20-6-5-18(31-32-20)15-7-9-33-19(13-28-21(33)12-15)16-3-2-4-17(11-16)30-22(34)29-14-23(24,25)26/h2-7,9,11-13H,8,10,14H2,1H3,(H,27,32)(H2,29,30,34)
Reactome pathway
US Patent
n/an/a 0.890n/an/an/an/a8.025
Astex Therapeutics Ltd
US Patent
Assay Description
Enzymes (from Upstate) were prepared at 2× final concentration in 1× kinase assay buffer (Table 1). Enzymes were then incubated with test compounds, ...
US Patent US8796244 (2014)
BindingDB Entry DOI: 10.7270/Q20C4TFP