BDBM128512 US8796244, 91
SMILES: Cc1ccc(nc1)-c1ccn2c(cnc2c1)-c1cccc(NC(=O)NCC(F)(F)F)c1
InChI Key: InChIKey=WAJZYUMMTDBTGH-UHFFFAOYSA-N
Data: 2 IC50
Activity Spreadsheet -- Enzyme Inhibition Constant Data from BindingDB
Found 2 hits for monomerid = 128512
Trg + Lig
Ki
nM
ΔG°
kcal/mole
IC50
nM
Kd
nM
EC50/IC50
nM
koff
s-1
kon
M-1s-1
pHTemp
°C
Vascular endothelial growth factor receptor 2
(Homo sapiens (Human))
BDBM128512
(US8796244, 91)
Show SMILES Cc1ccc(nc1)-c1ccn2c(cnc2c1)-c1cccc(NC(=O)NCC(F)(F)F)c1
Show InChI InChI=1S/C22H18F3N5O/c1-14-5-6-18(26-11-14)15-7-8-30-19(12-27-20(30)10-15)16-3-2-4-17(9-16)29-21(31)28-13-22(23,24)25/h2-12H,13H2,1H3,(H2,28,29,31)
NCI pathway
Reactome pathway
US Patent
n/an/a 26.9n/an/an/an/a8.025
Astex Therapeutics Ltd
US Patent
Assay Description
VEGFR2 (from Upstate), prepared at 2x final concentration, was incubated with test compounds, biotinylated Flt3 substrate (biotin-VASSDNEYFYVDF) (Cel...
US Patent US8796244 (2014)
BindingDB Entry DOI: 10.7270/Q20C4TFP
Fibroblast growth factor receptor 3
(Homo sapiens (Human))
BDBM128512
(US8796244, 91)
Show SMILES Cc1ccc(nc1)-c1ccn2c(cnc2c1)-c1cccc(NC(=O)NCC(F)(F)F)c1
Show InChI InChI=1S/C22H18F3N5O/c1-14-5-6-18(26-11-14)15-7-8-30-19(12-27-20(30)10-15)16-3-2-4-17(9-16)29-21(31)28-13-22(23,24)25/h2-12H,13H2,1H3,(H2,28,29,31)
Reactome pathway
US Patent
n/an/a 0.840n/an/an/an/a8.025
Astex Therapeutics Ltd
US Patent
Assay Description
Enzymes (from Upstate) were prepared at 2× final concentration in 1× kinase assay buffer (Table 1). Enzymes were then incubated with test compounds, ...
US Patent US8796244 (2014)
BindingDB Entry DOI: 10.7270/Q20C4TFP