BDBM12862 1-(3-amino-1,2-benzoxazol-5-yl)-3,5-dimethyl-6-[4-(2-{[methyl(propan-2-yl)amino]methyl}phenyl)phenyl]-1H,6H,7H-pyrazolo[4,3-d]pyrimidin-7-one::Pyrazolo[4,3-d]pyrimidinone 19h
SMILES: CC(C)N(C)Cc1ccccc1-c1ccc(cc1)-n1c(C)nc2c(C)nn(-c3ccc4onc(N)c4c3)c2c1=O
InChI Key: InChIKey=KLMPGRJKGKGQNY-UHFFFAOYSA-N
Data: 1 KI
Activity Spreadsheet -- Enzyme Inhibition Constant Data from BindingDB
Found 1 hit for monomerid = 12862
Trg + Lig
Ki
nM
ΔG°
kcal/mole
IC50
nM
Kd
nM
EC50/IC50
nM
koff
s-1
kon
M-1s-1
pHTemp
°C
Coagulation factor X
(Homo sapiens (Human))
BDBM12862
(1-(3-amino-1,2-benzoxazol-5-yl)-3,5-dimethyl-6-[4-...)
Show SMILES CC(C)N(C)Cc1ccccc1-c1ccc(cc1)-n1c(C)nc2c(C)nn(-c3ccc4onc(N)c4c3)c2c1=O
Show InChI InChI=1S/C31H31N7O2/c1-18(2)36(5)17-22-8-6-7-9-25(22)21-10-12-23(13-11-21)37-20(4)33-28-19(3)34-38(29(28)31(37)39)24-14-15-27-26(16-24)30(32)35-40-27/h6-16,18H,17H2,1-5H3,(H2,32,35)
Reactome pathway
0.350 -12.8n/an/an/an/an/a7.022
Bristol-Myers Squibb Pharmaceutical Research Institute
Assay Description
Ki values were obtained from human purified enzyme. All assays were run in microtiter plates. Plates were read for 30 min at 405 nm. Rates were deter...
Bioorg Med Chem Lett 16: 5176-82 (2006)
Article DOI: 10.1016/j.bmcl.2006.07.002
BindingDB Entry DOI: 10.7270/Q29K48GC