null
SMILES: Cc1cc2c(NC(=O)N[C@H]3CC[C@H](C3)c3ccccc3F)c(F)ccc2cn1
InChI Key: InChIKey=PJVXUKARZNCIRA-ZBFHGGJFSA-N
Activity Spreadsheet -- Enzyme Inhibition Constant Data from BindingDB
Found 1 hit for monomerid = 128914
Trg + Lig
Ki
nM
ΔG°
kcal/mole
IC50
nM
Kd
nM
EC50/IC50
nM
koff
s-1
kon
M-1s-1
pHTemp
°C
Transient receptor potential cation channel subfamily V member 1
(Homo sapiens (Human))
BDBM128914
(US8802711, 83)
Show SMILES Cc1cc2c(NC(=O)N[C@H]3CC[C@H](C3)c3ccccc3F)c(F)ccc2cn1
Show InChI InChI=1S/C22H21F2N3O/c1-13-10-18-15(12-25-13)7-9-20(24)21(18)27-22(28)26-16-8-6-14(11-16)17-4-2-3-5-19(17)23/h2-5,7,9-10,12,14,16H,6,8,11H2,1H3,(H2,26,27,28)/t14-,16+/m1/s1
Reactome pathway
US Patent
n/an/a 5.30n/an/an/an/an/an/a
AbbVie Inc.
US Patent
Assay Description
The functional activity of compounds at the TRPV1 receptor was determined by measurement of intracellular Ca2+ levels ([Ca2+]i) using the Fluorescenc...
US Patent US8802711 (2014)
BindingDB Entry DOI: 10.7270/Q2QZ28NC