BDBM129402 US8802673, 44
SMILES: C1CO[C@H](CN1)c1ccc(Nc2ccc3ccccc3c2)cc1
InChI Key: InChIKey=AZSUIFSWQMBTBW-HXUWFJFHSA-N
Data: 2 KI
Activity Spreadsheet -- Enzyme Inhibition Constant Data from BindingDB
Found 2 hits for monomerid = 129402
Trg + Lig
Ki
nM
ΔG°
kcal/mole
IC50
nM
Kd
nM
EC50/IC50
nM
koff
s-1
kon
M-1s-1
pHTemp
°C
Trace amine-associated receptor 1 (TAAR1)
(Mus musculus (Mouse))
BDBM129402
(US8802673, 44)
Show SMILES C1CO[C@H](CN1)c1ccc(Nc2ccc3ccccc3c2)cc1 |r|
Show InChI InChI=1S/C20H20N2O/c1-2-4-17-13-19(10-5-15(17)3-1)22-18-8-6-16(7-9-18)20-14-21-11-12-23-20/h1-10,13,20-22H,11-12,14H2/t20-/m1/s1
Reactome pathway
US Patent
0.700 -13.0n/an/an/an/an/a7.437
Hoffmann-La Roche Inc
US Patent
Assay Description
HEK-293 cells stably expressing rat TAAR1 were maintained at 37 C. and 5% CO2 in DMEM high glucose medium, containing fetal calf serum (10%, heat ina...
US Patent US8802673 (2014)
BindingDB Entry DOI: 10.7270/Q2348J2G
Trace amine-associated receptor 1 (TAAR1)
(Rattus norvegicus (Rat))
BDBM129402
(US8802673, 44)
Show SMILES C1CO[C@H](CN1)c1ccc(Nc2ccc3ccccc3c2)cc1 |r|
Show InChI InChI=1S/C20H20N2O/c1-2-4-17-13-19(10-5-15(17)3-1)22-18-8-6-16(7-9-18)20-14-21-11-12-23-20/h1-10,13,20-22H,11-12,14H2/t20-/m1/s1
US Patent
11.8 -11.2n/an/an/an/an/a7.437
Hoffmann-La Roche Inc
US Patent
Assay Description
HEK-293 cells stably expressing mouse TAAR1 were maintained at 37 C. and 5% CO2 in DMEM high glucose medium, containing fetal calf serum (10%, heat i...
US Patent US8802673 (2014)
BindingDB Entry DOI: 10.7270/Q2348J2G