BDBM129410 US8802673, 52
SMILES: Clc1cccc2ccc(Nc3ccc(cc3)[C@H]3CNCCO3)nc12
InChI Key: InChIKey=LQLYWBRGYCYYGN-QGZVFWFLSA-N
Data: 2 KI
Activity Spreadsheet -- Enzyme Inhibition Constant Data from BindingDB
Found 2 hits for monomerid = 129410
Trg + Lig
Ki
nM
ΔG°
kcal/mole
IC50
nM
Kd
nM
EC50/IC50
nM
koff
s-1
kon
M-1s-1
pHTemp
°C
Trace amine-associated receptor 1 (TAAR1)
(Mus musculus (Mouse))
BDBM129410
(US8802673, 52)
Show SMILES Clc1cccc2ccc(Nc3ccc(cc3)[C@H]3CNCCO3)nc12 |r|
Show InChI InChI=1S/C19H18ClN3O/c20-16-3-1-2-14-6-9-18(23-19(14)16)22-15-7-4-13(5-8-15)17-12-21-10-11-24-17/h1-9,17,21H,10-12H2,(H,22,23)/t17-/m1/s1
Reactome pathway
US Patent
0.5 -13.2n/an/an/an/an/a7.437
Hoffmann-La Roche Inc
US Patent
Assay Description
HEK-293 cells stably expressing rat TAAR1 were maintained at 37 C. and 5% CO2 in DMEM high glucose medium, containing fetal calf serum (10%, heat ina...
US Patent US8802673 (2014)
BindingDB Entry DOI: 10.7270/Q2348J2G
Trace amine-associated receptor 1 (TAAR1)
(Rattus norvegicus (Rat))
BDBM129410
(US8802673, 52)
Show SMILES Clc1cccc2ccc(Nc3ccc(cc3)[C@H]3CNCCO3)nc12 |r|
Show InChI InChI=1S/C19H18ClN3O/c20-16-3-1-2-14-6-9-18(23-19(14)16)22-15-7-4-13(5-8-15)17-12-21-10-11-24-17/h1-9,17,21H,10-12H2,(H,22,23)/t17-/m1/s1
US Patent
8.40 -11.5n/an/an/an/an/a7.437
Hoffmann-La Roche Inc
US Patent
Assay Description
HEK-293 cells stably expressing mouse TAAR1 were maintained at 37 C. and 5% CO2 in DMEM high glucose medium, containing fetal calf serum (10%, heat i...
US Patent US8802673 (2014)
BindingDB Entry DOI: 10.7270/Q2348J2G