BDBM129440 US8802673, 82
SMILES: FC(F)(F)c1cc(Nc2ccc(cc2)[C@H]2CNCCO2)ncc1Cl
InChI Key: InChIKey=DBGUEDAIQPJBQO-CQSZACIVSA-N
Data: 2 KI
Activity Spreadsheet -- Enzyme Inhibition Constant Data from BindingDB
Found 2 hits for monomerid = 129440
Trg + Lig
Ki
nM
ΔG°
kcal/mole
IC50
nM
Kd
nM
EC50/IC50
nM
koff
s-1
kon
M-1s-1
pHTemp
°C
Trace amine-associated receptor 1 (TAAR1)
(Mus musculus (Mouse))
BDBM129440
(US8802673, 82)
Show SMILES FC(F)(F)c1cc(Nc2ccc(cc2)[C@H]2CNCCO2)ncc1Cl |r|
Show InChI InChI=1S/C16H15ClF3N3O/c17-13-8-22-15(7-12(13)16(18,19)20)23-11-3-1-10(2-4-11)14-9-21-5-6-24-14/h1-4,7-8,14,21H,5-6,9H2,(H,22,23)/t14-/m1/s1
Reactome pathway
US Patent
0.800 -12.9n/an/an/an/an/a7.437
Hoffmann-La Roche Inc
US Patent
Assay Description
HEK-293 cells stably expressing rat TAAR1 were maintained at 37 C. and 5% CO2 in DMEM high glucose medium, containing fetal calf serum (10%, heat ina...
US Patent US8802673 (2014)
BindingDB Entry DOI: 10.7270/Q2348J2G
Trace amine-associated receptor 1 (TAAR1)
(Rattus norvegicus (Rat))
BDBM129440
(US8802673, 82)
Show SMILES FC(F)(F)c1cc(Nc2ccc(cc2)[C@H]2CNCCO2)ncc1Cl |r|
Show InChI InChI=1S/C16H15ClF3N3O/c17-13-8-22-15(7-12(13)16(18,19)20)23-11-3-1-10(2-4-11)14-9-21-5-6-24-14/h1-4,7-8,14,21H,5-6,9H2,(H,22,23)/t14-/m1/s1
US Patent
10.1 -11.3n/an/an/an/an/a7.437
Hoffmann-La Roche Inc
US Patent
Assay Description
HEK-293 cells stably expressing mouse TAAR1 were maintained at 37 C. and 5% CO2 in DMEM high glucose medium, containing fetal calf serum (10%, heat i...
US Patent US8802673 (2014)
BindingDB Entry DOI: 10.7270/Q2348J2G