BDBM129441 US8802673, 83
SMILES: Cc1cc(Nc2ccc(cc2)[C@H]2CNCCO2)ncc1Cl
InChI Key: InChIKey=ZDTHUJOLYCLOGX-OAHLLOKOSA-N
Data: 2 KI
Activity Spreadsheet -- Enzyme Inhibition Constant Data from BindingDB
Found 2 hits for monomerid = 129441
Trg + Lig
Ki
nM
ΔG°
kcal/mole
IC50
nM
Kd
nM
EC50/IC50
nM
koff
s-1
kon
M-1s-1
pHTemp
°C
Trace amine-associated receptor 1 (TAAR1)
(Mus musculus (Mouse))
BDBM129441
(US8802673, 83)
Show SMILES Cc1cc(Nc2ccc(cc2)[C@H]2CNCCO2)ncc1Cl |r|
Show InChI InChI=1S/C16H18ClN3O/c1-11-8-16(19-9-14(11)17)20-13-4-2-12(3-5-13)15-10-18-6-7-21-15/h2-5,8-9,15,18H,6-7,10H2,1H3,(H,19,20)/t15-/m1/s1
Reactome pathway
US Patent
0.600 -13.1n/an/an/an/an/a7.437
Hoffmann-La Roche Inc
US Patent
Assay Description
HEK-293 cells stably expressing rat TAAR1 were maintained at 37 C. and 5% CO2 in DMEM high glucose medium, containing fetal calf serum (10%, heat ina...
US Patent US8802673 (2014)
BindingDB Entry DOI: 10.7270/Q2348J2G
Trace amine-associated receptor 1 (TAAR1)
(Rattus norvegicus (Rat))
BDBM129441
(US8802673, 83)
Show SMILES Cc1cc(Nc2ccc(cc2)[C@H]2CNCCO2)ncc1Cl |r|
Show InChI InChI=1S/C16H18ClN3O/c1-11-8-16(19-9-14(11)17)20-13-4-2-12(3-5-13)15-10-18-6-7-21-15/h2-5,8-9,15,18H,6-7,10H2,1H3,(H,19,20)/t15-/m1/s1
US Patent
22.2 -10.9n/an/an/an/an/a7.437
Hoffmann-La Roche Inc
US Patent
Assay Description
HEK-293 cells stably expressing mouse TAAR1 were maintained at 37 C. and 5% CO2 in DMEM high glucose medium, containing fetal calf serum (10%, heat i...
US Patent US8802673 (2014)
BindingDB Entry DOI: 10.7270/Q2348J2G