BDBM12970 (2S)-N-[(2S)-5-carbamimidamido-1-oxo-1-(1,3-thiazol-2-yl)pentan-2-yl]-2-[(2S)-2-({[(1R)-1-(4-fluorophenyl)ethyl]carbamoyl}amino)-3-(pyridin-3-yl)propanamido]-3-methylbutanamide::alpha-ketothiazole analogue 30
SMILES: [#6]-[#6](-[#6])-[#6@H](-[#7]-[#6](=O)-[#6@H](-[#6]-c1cccnc1)-[#7]-[#6](=O)-[#7]-[#6@H](-[#6])-c1ccc(F)cc1)-[#6](=O)-[#7]-[#6@@H](-[#6]-[#6]-[#6]\[#7]=[#6](/[#7])-[#7])-[#6](=O)-c1nccs1
InChI Key: InChIKey=LJZUOIBSYJRCOZ-RYCFVGSHSA-N
Data: 2 IC50
Activity Spreadsheet -- Enzyme Inhibition Constant Data from BindingDB
Found 2 hits for monomerid = 12970
Trg + Lig
Ki
nM
ΔG°
kcal/mole
IC50
nM
Kd
nM
EC50/IC50
nM
koff
s-1
kon
M-1s-1
pHTemp
°C
Coagulation factor XI
(Homo sapiens (Human))
BDBM12970
((2S)-N-[(2S)-5-carbamimidamido-1-oxo-1-(1,3-thiazo...)
Show SMILES [#6]-[#6](-[#6])-[#6@H](-[#7]-[#6](=O)-[#6@H](-[#6]-c1cccnc1)-[#7]-[#6](=O)-[#7]-[#6@H](-[#6])-c1ccc(F)cc1)-[#6](=O)-[#7]-[#6@@H](-[#6]-[#6]-[#6]\[#7]=[#6](/[#7])-[#7])-[#6](=O)-c1nccs1 |r|
Show InChI InChI=1S/C31H40FN9O4S/c1-18(2)25(28(44)39-23(7-5-13-37-30(33)34)26(42)29-36-14-15-46-29)41-27(43)24(16-20-6-4-12-35-17-20)40-31(45)38-19(3)21-8-10-22(32)11-9-21/h4,6,8-12,14-15,17-19,23-25H,5,7,13,16H2,1-3H3,(H,39,44)(H,41,43)(H4,33,34,37)(H2,38,40,45)/t19-,23+,24+,25+/m1/s1
Reactome pathway
n/an/a 28n/an/an/an/an/an/a
Daiichi Asubio Medical Research Laboratories LLC (DAIAMED)
Assay Description
Enzyme peptidolytic activities were measured using a fluorogenic reporter group, 7-amido-4-methylcoumarin (AMC). Released AMC was measured at an emis...
J Med Chem 49: 7781-91 (2006)
Article DOI: 10.1021/jm060978s
BindingDB Entry DOI: 10.7270/Q2SJ1HTM
Prothrombin
(Homo sapiens (Human))
BDBM12970
((2S)-N-[(2S)-5-carbamimidamido-1-oxo-1-(1,3-thiazo...)
Show SMILES [#6]-[#6](-[#6])-[#6@H](-[#7]-[#6](=O)-[#6@H](-[#6]-c1cccnc1)-[#7]-[#6](=O)-[#7]-[#6@H](-[#6])-c1ccc(F)cc1)-[#6](=O)-[#7]-[#6@@H](-[#6]-[#6]-[#6]\[#7]=[#6](/[#7])-[#7])-[#6](=O)-c1nccs1 |r|
Show InChI InChI=1S/C31H40FN9O4S/c1-18(2)25(28(44)39-23(7-5-13-37-30(33)34)26(42)29-36-14-15-46-29)41-27(43)24(16-20-6-4-12-35-17-20)40-31(45)38-19(3)21-8-10-22(32)11-9-21/h4,6,8-12,14-15,17-19,23-25H,5,7,13,16H2,1-3H3,(H,39,44)(H,41,43)(H4,33,34,37)(H2,38,40,45)/t19-,23+,24+,25+/m1/s1
n/an/a 523n/an/an/an/an/an/a
Daiichi Asubio Medical Research Laboratories LLC (DAIAMED)
Assay Description
Enzyme peptidolytic activities were measured using a fluorogenic reporter group, 7-amido-4-methylcoumarin (AMC). Released AMC was measured at an emis...
J Med Chem 49: 7781-91 (2006)
Article DOI: 10.1021/jm060978s
BindingDB Entry DOI: 10.7270/Q2SJ1HTM