BDBM12974 (2S)-2-({[(1R)-1-(4-bromophenyl)ethyl]carbamoyl}amino)-N-[(1S)-1-{[(2S)-5-carbamimidamido-1-oxo-1-(1,3-thiazol-2-yl)pentan-2-yl]carbamoyl}-2-methylpropyl]butanediamide::alpha-ketothiazole analogue 34
SMILES: [#6]-[#6](-[#6])-[#6@H](-[#7]-[#6](=O)-[#6@H](-[#6]-[#6](-[#7])=O)-[#7]-[#6](=O)-[#7]-[#6@H](-[#6])-c1ccc(Br)cc1)-[#6](=O)-[#7]-[#6@@H](-[#6]-[#6]-[#6]\[#7]=[#6](/[#7])-[#7])-[#6](=O)-c1nccs1
InChI Key: InChIKey=MGDHZAAGZWEIJU-CCMRYFRJSA-N
Data: 3 IC50
PDB links: 1 PDB ID contains inhibitors having a similarity of 90% to this monomer.
Activity Spreadsheet -- Enzyme Inhibition Constant Data from BindingDB
Found 3 hits for monomerid = 12974
Trg + Lig
Ki
nM
ΔG°
kcal/mole
IC50
nM
Kd
nM
EC50/IC50
nM
koff
s-1
kon
M-1s-1
pHTemp
°C
Coagulation factor XI
(Homo sapiens (Human))
BDBM12974
((2S)-2-({[(1R)-1-(4-bromophenyl)ethyl]carbamoyl}am...)
Show SMILES [#6]-[#6](-[#6])-[#6@H](-[#7]-[#6](=O)-[#6@H](-[#6]-[#6](-[#7])=O)-[#7]-[#6](=O)-[#7]-[#6@H](-[#6])-c1ccc(Br)cc1)-[#6](=O)-[#7]-[#6@@H](-[#6]-[#6]-[#6]\[#7]=[#6](/[#7])-[#7])-[#6](=O)-c1nccs1 |r|
Show InChI InChI=1S/C27H38BrN9O5S/c1-14(2)21(24(41)35-18(5-4-10-33-26(30)31)22(39)25-32-11-12-43-25)37-23(40)19(13-20(29)38)36-27(42)34-15(3)16-6-8-17(28)9-7-16/h6-9,11-12,14-15,18-19,21H,4-5,10,13H2,1-3H3,(H2,29,38)(H,35,41)(H,37,40)(H4,30,31,33)(H2,34,36,42)/t15-,18+,19+,21+/m1/s1
Reactome pathway
n/an/a 8n/an/an/an/an/an/a
Daiichi Asubio Medical Research Laboratories LLC (DAIAMED)
Assay Description
Enzyme peptidolytic activities were measured using a fluorogenic reporter group, 7-amido-4-methylcoumarin (AMC). Released AMC was measured at an emis...
J Med Chem 49: 7781-91 (2006)
Article DOI: 10.1021/jm060978s
BindingDB Entry DOI: 10.7270/Q2SJ1HTM
Prothrombin
(Homo sapiens (Human))
BDBM12974
((2S)-2-({[(1R)-1-(4-bromophenyl)ethyl]carbamoyl}am...)
Show SMILES [#6]-[#6](-[#6])-[#6@H](-[#7]-[#6](=O)-[#6@H](-[#6]-[#6](-[#7])=O)-[#7]-[#6](=O)-[#7]-[#6@H](-[#6])-c1ccc(Br)cc1)-[#6](=O)-[#7]-[#6@@H](-[#6]-[#6]-[#6]\[#7]=[#6](/[#7])-[#7])-[#6](=O)-c1nccs1 |r|
Show InChI InChI=1S/C27H38BrN9O5S/c1-14(2)21(24(41)35-18(5-4-10-33-26(30)31)22(39)25-32-11-12-43-25)37-23(40)19(13-20(29)38)36-27(42)34-15(3)16-6-8-17(28)9-7-16/h6-9,11-12,14-15,18-19,21H,4-5,10,13H2,1-3H3,(H2,29,38)(H,35,41)(H,37,40)(H4,30,31,33)(H2,34,36,42)/t15-,18+,19+,21+/m1/s1
n/an/a 400n/an/an/an/an/an/a
Daiichi Asubio Medical Research Laboratories LLC (DAIAMED)
Assay Description
Enzyme peptidolytic activities were measured using a fluorogenic reporter group, 7-amido-4-methylcoumarin (AMC). Released AMC was measured at an emis...
J Med Chem 49: 7781-91 (2006)
Article DOI: 10.1021/jm060978s
BindingDB Entry DOI: 10.7270/Q2SJ1HTM
Coagulation factor X
(Homo sapiens (Human))
BDBM12974
((2S)-2-({[(1R)-1-(4-bromophenyl)ethyl]carbamoyl}am...)
Show SMILES [#6]-[#6](-[#6])-[#6@H](-[#7]-[#6](=O)-[#6@H](-[#6]-[#6](-[#7])=O)-[#7]-[#6](=O)-[#7]-[#6@H](-[#6])-c1ccc(Br)cc1)-[#6](=O)-[#7]-[#6@@H](-[#6]-[#6]-[#6]\[#7]=[#6](/[#7])-[#7])-[#6](=O)-c1nccs1 |r|
Show InChI InChI=1S/C27H38BrN9O5S/c1-14(2)21(24(41)35-18(5-4-10-33-26(30)31)22(39)25-32-11-12-43-25)37-23(40)19(13-20(29)38)36-27(42)34-15(3)16-6-8-17(28)9-7-16/h6-9,11-12,14-15,18-19,21H,4-5,10,13H2,1-3H3,(H2,29,38)(H,35,41)(H,37,40)(H4,30,31,33)(H2,34,36,42)/t15-,18+,19+,21+/m1/s1
Reactome pathway
n/an/a 1.60E+3n/an/an/an/an/an/a
Daiichi Asubio Medical Research Laboratories LLC (DAIAMED)
Assay Description
Enzyme peptidolytic activities were measured using a fluorogenic reporter group, 7-amido-4-methylcoumarin (AMC). Released AMC was measured at an emis...
J Med Chem 49: 7781-91 (2006)
Article DOI: 10.1021/jm060978s
BindingDB Entry DOI: 10.7270/Q2SJ1HTM