BDBM12976 (2S)-2-({[(1R)-1-(4-bromophenyl)ethyl]carbamoyl}amino)-N-[(1S)-1-{[(2S)-5-carbamimidamido-1-oxo-1-(1,3-thiazol-2-yl)pentan-2-yl]carbamoyl}-2-methylpropyl]-5-(carbamoylamino)pentanamide::alpha-ketothiazole analogue 36
SMILES: [#6]-[#6](-[#6])-[#6@H](-[#7]-[#6](=O)-[#6@H](-[#6]-[#6]-[#6]-[#7]-[#6](-[#7])=O)-[#7]-[#6](=O)-[#7]-[#6@H](-[#6])-c1ccc(Br)cc1)-[#6](=O)-[#7]-[#6@@H](-[#6]-[#6]-[#6]\[#7]=[#6](/[#7])-[#7])-[#6](=O)-c1nccs1
InChI Key: InChIKey=BGBJLVHKOHYLME-MNAPGUCWSA-N
Data: 6 IC50
PDB links: 1 PDB ID matches this monomer.
Activity Spreadsheet -- Enzyme Inhibition Constant Data from BindingDB
Found 6 hits for monomerid = 12976
Trg + Lig
Ki
nM
ΔG°
kcal/mole
IC50
nM
Kd
nM
EC50/IC50
nM
koff
s-1
kon
M-1s-1
pHTemp
°C
Coagulation factor XI
(Homo sapiens (Human))
BDBM12976
((2S)-2-({[(1R)-1-(4-bromophenyl)ethyl]carbamoyl}am...)
Show SMILES [#6]-[#6](-[#6])-[#6@H](-[#7]-[#6](=O)-[#6@H](-[#6]-[#6]-[#6]-[#7]-[#6](-[#7])=O)-[#7]-[#6](=O)-[#7]-[#6@H](-[#6])-c1ccc(Br)cc1)-[#6](=O)-[#7]-[#6@@H](-[#6]-[#6]-[#6]\[#7]=[#6](/[#7])-[#7])-[#6](=O)-c1nccs1 |r|
Show InChI InChI=1S/C29H43BrN10O5S/c1-16(2)22(25(43)38-20(6-4-12-35-27(31)32)23(41)26-34-14-15-46-26)40-24(42)21(7-5-13-36-28(33)44)39-29(45)37-17(3)18-8-10-19(30)11-9-18/h8-11,14-17,20-22H,4-7,12-13H2,1-3H3,(H,38,43)(H,40,42)(H4,31,32,35)(H3,33,36,44)(H2,37,39,45)/t17-,20+,21+,22+/m1/s1
Reactome pathway
n/an/a 30n/an/an/an/an/an/a
Daiichi Asubio Medical Research Laboratories LLC (DAIAMED)
Assay Description
Enzyme peptidolytic activities were measured using a fluorogenic reporter group, 7-amido-4-methylcoumarin (AMC). Released AMC was measured at an emis...
J Med Chem 49: 7781-91 (2006)
Article DOI: 10.1021/jm060978s
BindingDB Entry DOI: 10.7270/Q2SJ1HTM
3D
3D Structure (crystal)
Coagulation factor X
(Homo sapiens (Human))
BDBM12976
((2S)-2-({[(1R)-1-(4-bromophenyl)ethyl]carbamoyl}am...)
Show SMILES [#6]-[#6](-[#6])-[#6@H](-[#7]-[#6](=O)-[#6@H](-[#6]-[#6]-[#6]-[#7]-[#6](-[#7])=O)-[#7]-[#6](=O)-[#7]-[#6@H](-[#6])-c1ccc(Br)cc1)-[#6](=O)-[#7]-[#6@@H](-[#6]-[#6]-[#6]\[#7]=[#6](/[#7])-[#7])-[#6](=O)-c1nccs1 |r|
Show InChI InChI=1S/C29H43BrN10O5S/c1-16(2)22(25(43)38-20(6-4-12-35-27(31)32)23(41)26-34-14-15-46-26)40-24(42)21(7-5-13-36-28(33)44)39-29(45)37-17(3)18-8-10-19(30)11-9-18/h8-11,14-17,20-22H,4-7,12-13H2,1-3H3,(H,38,43)(H,40,42)(H4,31,32,35)(H3,33,36,44)(H2,37,39,45)/t17-,20+,21+,22+/m1/s1
Reactome pathway
n/an/a 1.90E+3n/an/an/an/an/an/a
Daiichi Asubio Medical Research Laboratories LLC (DAIAMED)
Assay Description
Enzyme peptidolytic activities were measured using a fluorogenic reporter group, 7-amido-4-methylcoumarin (AMC). Released AMC was measured at an emis...
J Med Chem 49: 7781-91 (2006)
Article DOI: 10.1021/jm060978s
BindingDB Entry DOI: 10.7270/Q2SJ1HTM
Coagulation factor X
(Homo sapiens (Human))
BDBM12976
((2S)-2-({[(1R)-1-(4-bromophenyl)ethyl]carbamoyl}am...)
Show SMILES [#6]-[#6](-[#6])-[#6@H](-[#7]-[#6](=O)-[#6@H](-[#6]-[#6]-[#6]-[#7]-[#6](-[#7])=O)-[#7]-[#6](=O)-[#7]-[#6@H](-[#6])-c1ccc(Br)cc1)-[#6](=O)-[#7]-[#6@@H](-[#6]-[#6]-[#6]\[#7]=[#6](/[#7])-[#7])-[#6](=O)-c1nccs1 |r|
Show InChI InChI=1S/C29H43BrN10O5S/c1-16(2)22(25(43)38-20(6-4-12-35-27(31)32)23(41)26-34-14-15-46-26)40-24(42)21(7-5-13-36-28(33)44)39-29(45)37-17(3)18-8-10-19(30)11-9-18/h8-11,14-17,20-22H,4-7,12-13H2,1-3H3,(H,38,43)(H,40,42)(H4,31,32,35)(H3,33,36,44)(H2,37,39,45)/t17-,20+,21+,22+/m1/s1
Reactome pathway
n/an/a 1.90E+3n/an/an/an/an/an/a
Johnson& Johnson Pharmaceutical Research& Development
Curated by ChEMBL
Assay Description
Inhibition of human factor 10a
Bioorg Med Chem 16: 1562-95 (2008)
Article DOI: 10.1016/j.bmc.2007.11.015
BindingDB Entry DOI: 10.7270/Q21J9BNH
Prothrombin
(Homo sapiens (Human))
BDBM12976
((2S)-2-({[(1R)-1-(4-bromophenyl)ethyl]carbamoyl}am...)
Show SMILES [#6]-[#6](-[#6])-[#6@H](-[#7]-[#6](=O)-[#6@H](-[#6]-[#6]-[#6]-[#7]-[#6](-[#7])=O)-[#7]-[#6](=O)-[#7]-[#6@H](-[#6])-c1ccc(Br)cc1)-[#6](=O)-[#7]-[#6@@H](-[#6]-[#6]-[#6]\[#7]=[#6](/[#7])-[#7])-[#6](=O)-c1nccs1 |r|
Show InChI InChI=1S/C29H43BrN10O5S/c1-16(2)22(25(43)38-20(6-4-12-35-27(31)32)23(41)26-34-14-15-46-26)40-24(42)21(7-5-13-36-28(33)44)39-29(45)37-17(3)18-8-10-19(30)11-9-18/h8-11,14-17,20-22H,4-7,12-13H2,1-3H3,(H,38,43)(H,40,42)(H4,31,32,35)(H3,33,36,44)(H2,37,39,45)/t17-,20+,21+,22+/m1/s1
n/an/a 1.10E+3n/an/an/an/an/an/a
Johnson& Johnson Pharmaceutical Research& Development
Curated by ChEMBL
Assay Description
Inhibition of human alpha-thrombin
Bioorg Med Chem 16: 1562-95 (2008)
Article DOI: 10.1016/j.bmc.2007.11.015
BindingDB Entry DOI: 10.7270/Q21J9BNH
Coagulation factor XI
(Homo sapiens (Human))
BDBM12976
((2S)-2-({[(1R)-1-(4-bromophenyl)ethyl]carbamoyl}am...)
Show SMILES [#6]-[#6](-[#6])-[#6@H](-[#7]-[#6](=O)-[#6@H](-[#6]-[#6]-[#6]-[#7]-[#6](-[#7])=O)-[#7]-[#6](=O)-[#7]-[#6@H](-[#6])-c1ccc(Br)cc1)-[#6](=O)-[#7]-[#6@@H](-[#6]-[#6]-[#6]\[#7]=[#6](/[#7])-[#7])-[#6](=O)-c1nccs1 |r|
Show InChI InChI=1S/C29H43BrN10O5S/c1-16(2)22(25(43)38-20(6-4-12-35-27(31)32)23(41)26-34-14-15-46-26)40-24(42)21(7-5-13-36-28(33)44)39-29(45)37-17(3)18-8-10-19(30)11-9-18/h8-11,14-17,20-22H,4-7,12-13H2,1-3H3,(H,38,43)(H,40,42)(H4,31,32,35)(H3,33,36,44)(H2,37,39,45)/t17-,20+,21+,22+/m1/s1
Reactome pathway
n/an/a 30n/an/an/an/an/an/a
Johnson& Johnson Pharmaceutical Research& Development
Curated by ChEMBL
Assay Description
Inhibition of human factor 11a
Bioorg Med Chem 16: 1562-95 (2008)
Article DOI: 10.1016/j.bmc.2007.11.015
BindingDB Entry DOI: 10.7270/Q21J9BNH
3D
3D Structure (crystal)
Prothrombin
(Homo sapiens (Human))
BDBM12976
((2S)-2-({[(1R)-1-(4-bromophenyl)ethyl]carbamoyl}am...)
Show SMILES [#6]-[#6](-[#6])-[#6@H](-[#7]-[#6](=O)-[#6@H](-[#6]-[#6]-[#6]-[#7]-[#6](-[#7])=O)-[#7]-[#6](=O)-[#7]-[#6@H](-[#6])-c1ccc(Br)cc1)-[#6](=O)-[#7]-[#6@@H](-[#6]-[#6]-[#6]\[#7]=[#6](/[#7])-[#7])-[#6](=O)-c1nccs1 |r|
Show InChI InChI=1S/C29H43BrN10O5S/c1-16(2)22(25(43)38-20(6-4-12-35-27(31)32)23(41)26-34-14-15-46-26)40-24(42)21(7-5-13-36-28(33)44)39-29(45)37-17(3)18-8-10-19(30)11-9-18/h8-11,14-17,20-22H,4-7,12-13H2,1-3H3,(H,38,43)(H,40,42)(H4,31,32,35)(H3,33,36,44)(H2,37,39,45)/t17-,20+,21+,22+/m1/s1
n/an/a 1.10E+3n/an/an/an/an/an/a
Daiichi Asubio Medical Research Laboratories LLC (DAIAMED)
Assay Description
Enzyme peptidolytic activities were measured using a fluorogenic reporter group, 7-amido-4-methylcoumarin (AMC). Released AMC was measured at an emis...
J Med Chem 49: 7781-91 (2006)
Article DOI: 10.1021/jm060978s
BindingDB Entry DOI: 10.7270/Q2SJ1HTM