BDBM12990 5-Chloro-N-{[(5S)-3-(3-fluoro-4-morpholin-4-ylphenyl)-2-oxo-1,3-oxazolidin-5-yl]methyl}thiophene-2-carboxamide::5-chloro-N-{[(5S)-3-[3-fluoro-4-(morpholin-4-yl)phenyl]-2-oxo-1,3-oxazolidin-5-yl]methyl}thiophene-2-carboxamide::BAY 59-7939 Analog 6
SMILES: Fc1cc(ccc1N1CCOCC1)N1C[C@H](CNC(=O)c2ccc(Cl)s2)OC1=O
InChI Key: InChIKey=MAOZUYDDGGFCKF-ZDUSSCGKSA-N
Data: 2 IC50
Activity Spreadsheet -- Enzyme Inhibition Constant Data from BindingDB
Found 2 hits for monomerid = 12990
Trg + Lig
Ki
nM
ΔG°
kcal/mole
IC50
nM
Kd
nM
EC50/IC50
nM
koff
s-1
kon
M-1s-1
pHTemp
°C
Coagulation factor X
(Homo sapiens (Human))
BDBM12990
(5-Chloro-N-{[(5S)-3-(3-fluoro-4-morpholin-4-ylphen...)
Show SMILES Fc1cc(ccc1N1CCOCC1)N1C[C@H](CNC(=O)c2ccc(Cl)s2)OC1=O |r|
Show InChI InChI=1S/C19H19ClFN3O4S/c20-17-4-3-16(29-17)18(25)22-10-13-11-24(19(26)28-13)12-1-2-15(14(21)9-12)23-5-7-27-8-6-23/h1-4,9,13H,5-8,10-11H2,(H,22,25)/t13-/m0/s1
Reactome pathway
n/an/a 32n/an/an/an/an/an/a
Bristol-Myers Squibb Company
Curated by ChEMBL
Assay Description
Inhibition of factor 10a
J Med Chem 53: 6243-74 (2010)
Article DOI: 10.1021/jm100146h
BindingDB Entry DOI: 10.7270/Q2CR5VBB
Coagulation factor X
(Homo sapiens (Human))
BDBM12990
(5-Chloro-N-{[(5S)-3-(3-fluoro-4-morpholin-4-ylphen...)
Show SMILES Fc1cc(ccc1N1CCOCC1)N1C[C@H](CNC(=O)c2ccc(Cl)s2)OC1=O |r|
Show InChI InChI=1S/C19H19ClFN3O4S/c20-17-4-3-16(29-17)18(25)22-10-13-11-24(19(26)28-13)12-1-2-15(14(21)9-12)23-5-7-27-8-6-23/h1-4,9,13H,5-8,10-11H2,(H,22,25)/t13-/m0/s1
Reactome pathway
n/an/a 32n/an/an/an/a8.325
Bayer HealthCare AG
Assay Description
The enzymatic activity was measured using chromogenic or fluorogenic substrates in 96-well microtiter plates.Color change was monitored continuously ...
J Med Chem 48: 5900-8 (2005)
Article DOI: 10.1021/jm050101d
BindingDB Entry DOI: 10.7270/Q2J38QR6