BDBM129942 US8815926, 223
SMILES: COc1ccc(cc1-c1nc2C(=O)N([C@H](c2n1C(C)C)c1ccc(Cl)cc1C)c1cc(Cl)ccc1C)C(=O)N(C)C
InChI Key: InChIKey=IFRGIPSPDFJEEX-NDEPHWFRSA-N
Data: 1 IC50
Activity Spreadsheet -- Enzyme Inhibition Constant Data from BindingDB
Found 1 hit for monomerid = 129942
Trg + Lig
Ki
nM
ΔG°
kcal/mole
IC50
nM
Kd
nM
EC50/IC50
nM
koff
s-1
kon
M-1s-1
pHTemp
°C
MDM2-MDMX
(Homo sapiens (Human))
BDBM129942
(US8815926, 223)
Show SMILES COc1ccc(cc1-c1nc2C(=O)N([C@H](c2n1C(C)C)c1ccc(Cl)cc1C)c1cc(Cl)ccc1C)C(=O)N(C)C |r|
Show InChI InChI=1S/C32H32Cl2N4O3/c1-17(2)37-29-27(35-30(37)24-15-20(31(39)36(5)6)9-13-26(24)41-7)32(40)38(25-16-22(34)10-8-18(25)3)28(29)23-12-11-21(33)14-19(23)4/h8-17,28H,1-7H3/t28-/m0/s1
NCI pathway
Reactome pathway
US Patent
n/an/a 0.0900n/an/an/an/an/an/a
Novartis AG
US Patent
Assay Description
The inhibition of p53-MDM2 and p53-MDM4 interactions is measured by time resolved fluorescence energy transfer (TR-FRET). Fluorescence energy transfe...
US Patent US8815926 (2014)
BindingDB Entry DOI: 10.7270/Q29P309G