BDBM129966 US8815926, 247
SMILES: COc1nc(ncc1-c1nc2C(=O)N(C(c2n1C(C)C)c1ccc(C#N)c(F)c1)c1cccc(Cl)c1F)N(C)C
InChI Key: InChIKey=LUZOCJAWBOFFDE-UHFFFAOYSA-N
Data: 1 IC50
Activity Spreadsheet -- Enzyme Inhibition Constant Data from BindingDB
Found 1 hit for monomerid = 129966
Trg + Lig
Ki
nM
ΔG°
kcal/mole
IC50
nM
Kd
nM
EC50/IC50
nM
koff
s-1
kon
M-1s-1
pHTemp
°C
MDM2-MDMX
(Homo sapiens (Human))
BDBM129966
(US8815926, 247)
Show SMILES COc1nc(ncc1-c1nc2C(=O)N(C(c2n1C(C)C)c1ccc(C#N)c(F)c1)c1cccc(Cl)c1F)N(C)C
Show InChI InChI=1S/C28H24ClF2N7O2/c1-14(2)37-24-22(34-25(37)17-13-33-28(36(3)4)35-26(17)40-5)27(39)38(20-8-6-7-18(29)21(20)31)23(24)15-9-10-16(12-32)19(30)11-15/h6-11,13-14,23H,1-5H3
NCI pathway
Reactome pathway
US Patent
n/an/a 0.0800n/an/an/an/an/an/a
Novartis AG
US Patent
Assay Description
The inhibition of p53-MDM2 and p53-MDM4 interactions is measured by time resolved fluorescence energy transfer (TR-FRET). Fluorescence energy transfe...
US Patent US8815926 (2014)
BindingDB Entry DOI: 10.7270/Q29P309G