BDBM130077 US8815901, 127
SMILES: COc1cc(OC)c(F)c(c1F)-c1ccc(C(=O)Nc2ncc(CN(C)C)[nH]2)c2nccnc12
InChI Key: InChIKey=XIFFUJNWCYQIBQ-UHFFFAOYSA-N
Data: 1 IC50
Activity Spreadsheet -- Enzyme Inhibition Constant Data from BindingDB
Found 1 hit for monomerid = 130077
Trg + Lig
Ki
nM
ΔG°
kcal/mole
IC50
nM
Kd
nM
EC50/IC50
nM
koff
s-1
kon
M-1s-1
pHTemp
°C
Fibroblast growth factor receptor 3
(Homo sapiens (Human))
BDBM130077
(US8815901, 127)
Show SMILES COc1cc(OC)c(F)c(c1F)-c1ccc(C(=O)Nc2ncc(CN(C)C)[nH]2)c2nccnc12 |(7.42,4,;8.19,2.67,;7.42,1.33,;8.19,,;7.42,-1.33,;8.19,-2.67,;9.73,-2.67,;5.88,-1.33,;5.11,-2.67,;5.11,,;5.88,1.33,;5.11,2.67,;3.57,,;2.8,1.33,;1.26,1.33,;.49,,;-1.05,,;-1.82,1.33,;-1.82,-1.33,;-3.36,-1.33,;-4.26,-.09,;-5.73,-.56,;-5.73,-2.1,;-7.06,-2.87,;-8.4,-2.1,;-8.4,-.56,;-9.73,-2.87,;-4.26,-2.58,;1.26,-1.33,;.49,-2.67,;1.26,-4,;2.8,-4,;3.57,-2.67,;2.8,-1.33,)|
Show InChI InChI=1S/C23H22F2N6O3/c1-31(2)11-12-10-28-23(29-12)30-22(32)14-6-5-13(20-21(14)27-8-7-26-20)17-18(24)15(33-3)9-16(34-4)19(17)25/h5-10H,11H2,1-4H3,(H2,28,29,30,32)
Reactome pathway
US Patent
n/an/a 16n/an/an/an/an/a25
Novartis AG
US Patent
Assay Description
The assay has been run at room temperature on a liquid handling robot. To the assay plates containing 50 mL compound or control solutions, 4.5 uL of ...
US Patent US8815901 (2014)
BindingDB Entry DOI: 10.7270/Q2XG9PT8