null
SMILES: Clc1ncc(s1)C(=O)NC[C@H]1CN(C(=O)O1)c1ccc(cc1)N1CCOCC1=O
InChI Key: InChIKey=ZDLLSWMVGIODIZ-ZDUSSCGKSA-N
Activity Spreadsheet -- Enzyme Inhibition Constant Data from BindingDB
Found 1 hit for monomerid = 13009
Trg + Lig
Ki
nM
ΔG°
kcal/mole
IC50
nM
Kd
nM
EC50/IC50
nM
koff
s-1
kon
M-1s-1
pHTemp
°C
Coagulation factor X
(Homo sapiens (Human))
BDBM13009
(2-Chloro-N-({(5S)-2-oxo-3-[4-(3-oxomorpholin-4-yl)...)
Show SMILES Clc1ncc(s1)C(=O)NC[C@H]1CN(C(=O)O1)c1ccc(cc1)N1CCOCC1=O |r|
Show InChI InChI=1S/C18H17ClN4O5S/c19-17-21-8-14(29-17)16(25)20-7-13-9-23(18(26)28-13)12-3-1-11(2-4-12)22-5-6-27-10-15(22)24/h1-4,8,13H,5-7,9-10H2,(H,20,25)/t13-/m0/s1
Reactome pathway
n/an/a 290n/an/an/an/an/an/a
Bayer HealthCare AG
Assay Description
The enzymatic activity was measured using chromogenic or fluorogenic substrates in 96-well microtiter plates.Color change was monitored continuously ...
J Med Chem 48: 5900-8 (2005)
Article DOI: 10.1021/jm050101d
BindingDB Entry DOI: 10.7270/Q2J38QR6