null
SMILES: Clc1ccc(nc1)C(=O)NC[C@H]1CN(C(=O)O1)c1ccc(cc1)N1CCOCC1=O
InChI Key: InChIKey=ZXSTZOOEFRAGJG-INIZCTEOSA-N
Activity Spreadsheet -- Enzyme Inhibition Constant Data from BindingDB
Found 1 hit for monomerid = 13010
Trg + Lig
Ki
nM
ΔG°
kcal/mole
IC50
nM
Kd
nM
EC50/IC50
nM
koff
s-1
kon
M-1s-1
pHTemp
°C
Coagulation factor X
(Homo sapiens (Human))
BDBM13010
(5-Chloro-N-({(5S)-2-oxo-3-[4-(3-oxomorpholin-4-yl)...)
Show SMILES Clc1ccc(nc1)C(=O)NC[C@H]1CN(C(=O)O1)c1ccc(cc1)N1CCOCC1=O |r|
Show InChI InChI=1S/C20H19ClN4O5/c21-13-1-6-17(22-9-13)19(27)23-10-16-11-25(20(28)30-16)15-4-2-14(3-5-15)24-7-8-29-12-18(24)26/h1-6,9,16H,7-8,10-12H2,(H,23,27)/t16-/m0/s1
Reactome pathway
n/an/a 29n/an/an/an/an/an/a
Bayer HealthCare AG
Assay Description
The enzymatic activity was measured using chromogenic or fluorogenic substrates in 96-well microtiter plates.Color change was monitored continuously ...
J Med Chem 48: 5900-8 (2005)
Article DOI: 10.1021/jm050101d
BindingDB Entry DOI: 10.7270/Q2J38QR6