BDBM130366 US8822534, Example 11-11::US8993631, 9-6
SMILES: OC(=O)C[C@@H](Cc1ccc(cc1)-c1cccc(Cl)c1)NC(=O)C(F)(F)C(F)(F)C(O)=O
InChI Key: InChIKey=UIUMOTUFXJFVKO-OAHLLOKOSA-N
Data: 2 IC50
Activity Spreadsheet -- Enzyme Inhibition Constant Data from BindingDB
Found 2 hits for monomerid = 130366
Trg + Lig
Ki
nM
ΔG°
kcal/mole
IC50
nM
Kd
nM
EC50/IC50
nM
koff
s-1
kon
M-1s-1
pHTemp
°C
Neutral endopeptidase (NEP)
(Homo sapiens (Human))
BDBM130366
(US8822534, Example 11-11 | US8993631, 9-6)
Show SMILES OC(=O)C[C@@H](Cc1ccc(cc1)-c1cccc(Cl)c1)NC(=O)C(F)(F)C(F)(F)C(O)=O
Show InChI InChI=1S/C20H16ClF4NO5/c21-14-3-1-2-13(9-14)12-6-4-11(5-7-12)8-15(10-16(27)28)26-17(29)19(22,23)20(24,25)18(30)31/h1-7,9,15H,8,10H2,(H,26,29)(H,27,28)(H,30,31)/t15-/m1/s1
US Patent
n/an/a 0.5n/an/an/an/a7.425
Novartis AG
US Patent
Assay Description
Recombinant human neutral endopeptidase (expressed in insect cells and purified using standard methods, final concentration 7 μM) is pre-incubat...
US Patent US8993631 (2015)
BindingDB Entry DOI: 10.7270/Q20C4THK
Neutral endopeptidase (NEP)
(Homo sapiens (Human))
BDBM130366
(US8822534, Example 11-11 | US8993631, 9-6)
Show SMILES OC(=O)C[C@@H](Cc1ccc(cc1)-c1cccc(Cl)c1)NC(=O)C(F)(F)C(F)(F)C(O)=O
Show InChI InChI=1S/C20H16ClF4NO5/c21-14-3-1-2-13(9-14)12-6-4-11(5-7-12)8-15(10-16(27)28)26-17(29)19(22,23)20(24,25)18(30)31/h1-7,9,15H,8,10H2,(H,26,29)(H,27,28)(H,30,31)/t15-/m1/s1
US Patent
n/an/a 0.5n/an/an/an/a7.425
Novartis AG
US Patent
Assay Description
Recombinant human neutral endopeptidase (expressed in insect cells and purified using standard methods, final concentration 7 μM) is pre-incubat...
US Patent US8822534 (2014)
BindingDB Entry DOI: 10.7270/Q2513WW2