null
SMILES: OC(=O)CNC(=O)N[C@@H](CC(O)=O)Cc1ccc(cc1)-c1cccc(Cl)c1
InChI Key: InChIKey=MVTZRJHEQPXHNU-MRXNPFEDSA-N
Activity Spreadsheet -- Enzyme Inhibition Constant Data from BindingDB
Found 2 hits for monomerid = 130369
Trg + Lig
Ki
nM
ΔG°
kcal/mole
IC50
nM
Kd
nM
EC50/IC50
nM
koff
s-1
kon
M-1s-1
pHTemp
°C
Membrane metallo-endopeptidase-like 1
(Homo sapiens (Human))
BDBM130369
(US8822534, Example 14-1 | US8993631, 11-1)
Show SMILES OC(=O)CNC(=O)N[C@@H](CC(O)=O)Cc1ccc(cc1)-c1cccc(Cl)c1
Show InChI InChI=1S/C19H19ClN2O5/c20-15-3-1-2-14(9-15)13-6-4-12(5-7-13)8-16(10-17(23)24)22-19(27)21-11-18(25)26/h1-7,9,16H,8,10-11H2,(H,23,24)(H,25,26)(H2,21,22,27)/t16-/m1/s1
US Patent
n/an/a 0.800n/an/an/an/a7.425
Novartis AG
US Patent
Assay Description
Recombinant human neutral endopeptidase (expressed in insect cells and purified using standard methods, final concentration 7 μM) is pre-incubat...
US Patent US8993631 (2015)
BindingDB Entry DOI: 10.7270/Q20C4THK
Membrane metallo-endopeptidase-like 1
(Homo sapiens (Human))
BDBM130369
(US8822534, Example 14-1 | US8993631, 11-1)
Show SMILES OC(=O)CNC(=O)N[C@@H](CC(O)=O)Cc1ccc(cc1)-c1cccc(Cl)c1
Show InChI InChI=1S/C19H19ClN2O5/c20-15-3-1-2-14(9-15)13-6-4-12(5-7-13)8-16(10-17(23)24)22-19(27)21-11-18(25)26/h1-7,9,16H,8,10-11H2,(H,23,24)(H,25,26)(H2,21,22,27)/t16-/m1/s1
US Patent
n/an/a 0.800n/an/an/an/a7.425
Novartis AG
US Patent
Assay Description
Recombinant human neutral endopeptidase (expressed in insect cells and purified using standard methods, final concentration 7 μM) is pre-incubat...
US Patent US8822534 (2014)
BindingDB Entry DOI: 10.7270/Q2513WW2