BDBM130380 nor-N-hydroxy-L-arginine (nor-NOHA)
SMILES: N\C(CCC[C@H]([NH3+])C([O-])=O)=[NH+]/O
InChI Key: InChIKey=PBCFGJXLQHHNBL-BYPYZUCNSA-O
Data: 1 Kd
Activity Spreadsheet -- Enzyme Inhibition Constant Data from BindingDB
Found 1 hit for monomerid = 130380
Trg + Lig
Ki
nM
ΔG°
kcal/mole
IC50
nM
Kd
nM
EC50/IC50
nM
koff
s-1
kon
M-1s-1
pHTemp
°C
Arginase (SmARG)
(Schistosoma mansoni (flatworms))
BDBM130380
(nor-N-hydroxy-L-arginine (nor-NOHA))
Show SMILES N\C(CCC[C@H]([NH3+])C([O-])=O)=[NH+]/O |r|
Show InChI InChI=1S/C6H13N3O3/c7-4(6(10)11)2-1-3-5(8)9-12/h4,12H,1-3,7H2,(H2,8,9)(H,10,11)/p+1/t4-/m0/s1
n/an/an/a 360n/an/an/a8.5n/a
University of Pennsylvania
Assay Description
SmARG was dialyzed against 50 mM bicine (pH 8.5), 100 μM MnCl2, and 1.0 mM TCEP [5% (v/v) DMSO was included in the dialysis buffer when SmARG wa...
Biochemistry 53: 4671-4684 (2014)
Article DOI: 10.1021/bi5004519
BindingDB Entry DOI: 10.7270/Q2RR1WZQ