BDBM130392 US8822510, 63
SMILES: OC(=O)C1CN(Cc2ccc(cc2)-c2noc(CCC3(CCCCC3)c3ccc(F)cc3)n2)C1
InChI Key: InChIKey=DMPAAYFQWGNDNK-UHFFFAOYSA-N
Data: 1 IC50
Activity Spreadsheet -- Enzyme Inhibition Constant Data from BindingDB
Found 1 hit for monomerid = 130392
Trg + Lig
Ki
nM
ΔG°
kcal/mole
IC50
nM
Kd
nM
EC50/IC50
nM
koff
s-1
kon
M-1s-1
pHTemp
°C
Sphingosine 1-phosphate receptor 1
(Homo sapiens (Human))
BDBM130392
(US8822510, 63)
Show SMILES OC(=O)C1CN(Cc2ccc(cc2)-c2noc(CCC3(CCCCC3)c3ccc(F)cc3)n2)C1
Show InChI InChI=1S/C27H30FN3O3/c28-23-10-8-22(9-11-23)27(13-2-1-3-14-27)15-12-24-29-25(30-34-24)20-6-4-19(5-7-20)16-31-17-21(18-31)26(32)33/h4-11,21H,1-3,12-18H2,(H,32,33)
Reactome pathway
US Patent
n/an/a 0.210n/an/an/an/a7.525
Bristol-Myers Squibb Company
US Patent
Assay Description
Membranes were prepared from CHO cells expressing human S1P1. Cells pellets (1x 108 cells/pellet) were suspended in buffer containing 20 mM HEPES, pH...
US Patent US8822510 (2014)
BindingDB Entry DOI: 10.7270/Q2H70DHC