null
SMILES: NS(=O)(=O)c1ccc(s1)S(=O)(=O)c1cccs1
InChI Key: InChIKey=PKSPQYUQOOXIOO-UHFFFAOYSA-N
Activity Spreadsheet -- Enzyme Inhibition Constant Data from BindingDB
Found 1 hit for monomerid = 13077
Trg + Lig
Ki
nM
ΔG°
kcal/mole
IC50
nM
Kd
nM
EC50/IC50
nM
koff
s-1
kon
M-1s-1
pHTemp
°C
Carbonic anhydrase 2
(Homo sapiens (Human))
BDBM13077
(5-(thiophene-2-sulfonyl)thiophene-2-sulfonamide | ...)
Show SMILES NS(=O)(=O)c1ccc(s1)S(=O)(=O)c1cccs1
Show InChI InChI=1S/C8H7NO4S4/c9-17(12,13)8-4-3-7(15-8)16(10,11)6-2-1-5-14-6/h1-5H,(H2,9,12,13)
Reactome pathway
n/an/a 0.810n/an/an/an/a7.425
University of Marburg
Assay Description
Initial rates of 4-nitrophenyl acetate hydrolysis catalyzed by different CA isozymes were monitored spectrophotometrically at 400 nm. A molar absorpt...
J Med Chem 45: 3588-602 (2002)
Article DOI: 10.1021/jm011112j
BindingDB Entry DOI: 10.7270/Q2RJ4GQP