BDBM130860 US8829199, 115
SMILES: Cc1nc2ccc(cc2n1)-n1ncc(C(=O)c2cc3cc(CN4CCCC(F)C4)ccc3[nH]2)c1N
InChI Key: InChIKey=SPXNVPJERGMJSD-UHFFFAOYSA-N
Data: 3 IC50
Activity Spreadsheet -- Enzyme Inhibition Constant Data from BindingDB
Found 3 hits for monomerid = 130860
Trg + Lig
Ki
nM
ΔG°
kcal/mole
IC50
nM
Kd
nM
EC50/IC50
nM
koff
s-1
kon
M-1s-1
pHTemp
°C
Fibroblast growth factor receptor 1
(Homo sapiens (Human))
BDBM130860
(US8829199, 115)
Show SMILES Cc1nc2ccc(cc2n1)-n1ncc(C(=O)c2cc3cc(CN4CCCC(F)C4)ccc3[nH]2)c1N
Show InChI InChI=1S/C26H26FN7O/c1-15-30-22-7-5-19(11-23(22)31-15)34-26(28)20(12-29-34)25(35)24-10-17-9-16(4-6-21(17)32-24)13-33-8-2-3-18(27)14-33/h4-7,9-12,18,32H,2-3,8,13-14,28H2,1H3,(H,30,31)
NCI pathway
Reactome pathway
US Patent
n/an/a 0.670n/an/an/an/an/an/a
Chugai Seiyaku Kabushiki Kaisha; F. Hoffmann-La Roche AG
US Patent
Assay Description
The FGFR1-inhibiting activity was measured based on the activity to inhibit phosphorylation of the biotinylated peptide EGPWLEEEEEAYGWMDF by the huma...
US Patent US8829199 (2014)
BindingDB Entry DOI: 10.7270/Q26T0KB8
Fibroblast growth factor receptor 3
(Homo sapiens (Human))
BDBM130860
(US8829199, 115)
Show SMILES Cc1nc2ccc(cc2n1)-n1ncc(C(=O)c2cc3cc(CN4CCCC(F)C4)ccc3[nH]2)c1N
Show InChI InChI=1S/C26H26FN7O/c1-15-30-22-7-5-19(11-23(22)31-15)34-26(28)20(12-29-34)25(35)24-10-17-9-16(4-6-21(17)32-24)13-33-8-2-3-18(27)14-33/h4-7,9-12,18,32H,2-3,8,13-14,28H2,1H3,(H,30,31)
Reactome pathway
US Patent
n/an/a 30n/an/an/an/an/an/a
Chugai Seiyaku Kabushiki Kaisha; F. Hoffmann-La Roche AG
US Patent
Assay Description
The FGFR3-inhibiting activity was measured based on the activity to inhibit phosphorylation of the biotinylated peptide EGPWLEEEEEAYGWMDF by the huma...
US Patent US8829199 (2014)
BindingDB Entry DOI: 10.7270/Q26T0KB8
Fibroblast growth factor receptor 2
(Homo sapiens (Human))
BDBM130860
(US8829199, 115)
Show SMILES Cc1nc2ccc(cc2n1)-n1ncc(C(=O)c2cc3cc(CN4CCCC(F)C4)ccc3[nH]2)c1N
Show InChI InChI=1S/C26H26FN7O/c1-15-30-22-7-5-19(11-23(22)31-15)34-26(28)20(12-29-34)25(35)24-10-17-9-16(4-6-21(17)32-24)13-33-8-2-3-18(27)14-33/h4-7,9-12,18,32H,2-3,8,13-14,28H2,1H3,(H,30,31)
NCI pathway
Reactome pathway
US Patent
n/an/a 8.5n/an/an/an/an/an/a
Chugai Seiyaku Kabushiki Kaisha; F. Hoffmann-La Roche AG
US Patent
Assay Description
The FGFR2-inhibiting activity was measured based on the activity to inhibit phosphorylation of the biotinylated peptide EGPWLEEEEEAYGWMDF by the huma...
US Patent US8829199 (2014)
BindingDB Entry DOI: 10.7270/Q26T0KB8