BDBM130866 US8829199, 132
SMILES: Cc1nc2ccc(cc2n1)-n1ncc(C(=O)c2cc3ccc(CN4CCOCC4)cc3[nH]2)c1N
InChI Key: InChIKey=TVWOUPGUUIDZET-UHFFFAOYSA-N
Data: 3 IC50
Activity Spreadsheet -- Enzyme Inhibition Constant Data from BindingDB
Found 3 hits for monomerid = 130866
Trg + Lig
Ki
nM
ΔG°
kcal/mole
IC50
nM
Kd
nM
EC50/IC50
nM
koff
s-1
kon
M-1s-1
pHTemp
°C
Fibroblast growth factor receptor 1
(Homo sapiens (Human))
BDBM130866
(US8829199, 132)
Show SMILES Cc1nc2ccc(cc2n1)-n1ncc(C(=O)c2cc3ccc(CN4CCOCC4)cc3[nH]2)c1N
Show InChI InChI=1S/C25H25N7O2/c1-15-28-20-5-4-18(12-22(20)29-15)32-25(26)19(13-27-32)24(33)23-11-17-3-2-16(10-21(17)30-23)14-31-6-8-34-9-7-31/h2-5,10-13,30H,6-9,14,26H2,1H3,(H,28,29)
NCI pathway
Reactome pathway
US Patent
n/an/a 1.40n/an/an/an/an/an/a
Chugai Seiyaku Kabushiki Kaisha; F. Hoffmann-La Roche AG
US Patent
Assay Description
The FGFR1-inhibiting activity was measured based on the activity to inhibit phosphorylation of the biotinylated peptide EGPWLEEEEEAYGWMDF by the huma...
US Patent US8829199 (2014)
BindingDB Entry DOI: 10.7270/Q26T0KB8
Fibroblast growth factor receptor 3
(Homo sapiens (Human))
BDBM130866
(US8829199, 132)
Show SMILES Cc1nc2ccc(cc2n1)-n1ncc(C(=O)c2cc3ccc(CN4CCOCC4)cc3[nH]2)c1N
Show InChI InChI=1S/C25H25N7O2/c1-15-28-20-5-4-18(12-22(20)29-15)32-25(26)19(13-27-32)24(33)23-11-17-3-2-16(10-21(17)30-23)14-31-6-8-34-9-7-31/h2-5,10-13,30H,6-9,14,26H2,1H3,(H,28,29)
Reactome pathway
US Patent
n/an/a 3.5n/an/an/an/an/an/a
Chugai Seiyaku Kabushiki Kaisha; F. Hoffmann-La Roche AG
US Patent
Assay Description
The FGFR3-inhibiting activity was measured based on the activity to inhibit phosphorylation of the biotinylated peptide EGPWLEEEEEAYGWMDF by the huma...
US Patent US8829199 (2014)
BindingDB Entry DOI: 10.7270/Q26T0KB8
Fibroblast growth factor receptor 2
(Homo sapiens (Human))
BDBM130866
(US8829199, 132)
Show SMILES Cc1nc2ccc(cc2n1)-n1ncc(C(=O)c2cc3ccc(CN4CCOCC4)cc3[nH]2)c1N
Show InChI InChI=1S/C25H25N7O2/c1-15-28-20-5-4-18(12-22(20)29-15)32-25(26)19(13-27-32)24(33)23-11-17-3-2-16(10-21(17)30-23)14-31-6-8-34-9-7-31/h2-5,10-13,30H,6-9,14,26H2,1H3,(H,28,29)
NCI pathway
Reactome pathway
US Patent
n/an/a 3.40n/an/an/an/an/an/a
Chugai Seiyaku Kabushiki Kaisha; F. Hoffmann-La Roche AG
US Patent
Assay Description
The FGFR2-inhibiting activity was measured based on the activity to inhibit phosphorylation of the biotinylated peptide EGPWLEEEEEAYGWMDF by the huma...
US Patent US8829199 (2014)
BindingDB Entry DOI: 10.7270/Q26T0KB8