BDBM130986 US8829010, 37
SMILES: Cn1ncc(-c2nn(C)c3ncnc(N4CCC4)c23)c1-c1ccc(cn1)C1CC1
InChI Key: InChIKey=PAWPQSSHICPOCS-UHFFFAOYSA-N
Data: 2 IC50
Activity Spreadsheet -- Enzyme Inhibition Constant Data from BindingDB
Found 2 hits for monomerid = 130986
Trg + Lig
Ki
nM
ΔG°
kcal/mole
IC50
nM
Kd
nM
EC50/IC50
nM
koff
s-1
kon
M-1s-1
pHTemp
°C
cGMP-dependent 3',5'-cyclic phosphodiesterase
(Homo sapiens (Human))
BDBM130986
(US8829010, 37)
Show SMILES Cn1ncc(-c2nn(C)c3ncnc(N4CCC4)c23)c1-c1ccc(cn1)C1CC1
Show InChI InChI=1S/C21H22N8/c1-27-19(16-7-6-14(10-22-16)13-4-5-13)15(11-25-27)18-17-20(28(2)26-18)23-12-24-21(17)29-8-3-9-29/h6-7,10-13H,3-5,8-9H2,1-2H3
n/an/a 8.90n/an/an/an/an/an/a
Pfizer Inc.
Curated by ChEMBL
Assay Description
Inhibition of full length recombinant human FLAG-tagged PDE2A3 expressed in sf21 cells using [3H]cGMP as substrate by scintillation proximity assay
J Med Chem 60: 5673-5698 (2017)
Article DOI: 10.1021/acs.jmedchem.7b00397
BindingDB Entry DOI: 10.7270/Q2VX0JNT
cGMP-dependent 3',5'-cyclic phosphodiesterase
(Homo sapiens (Human))
BDBM130986
(US8829010, 37)
Show SMILES Cn1ncc(-c2nn(C)c3ncnc(N4CCC4)c23)c1-c1ccc(cn1)C1CC1
Show InChI InChI=1S/C21H22N8/c1-27-19(16-7-6-14(10-22-16)13-4-5-13)15(11-25-27)18-17-20(28(2)26-18)23-12-24-21(17)29-8-3-9-29/h6-7,10-13H,3-5,8-9H2,1-2H3
US Patent
n/an/a 8.93n/an/an/an/an/an/a
Pfizer Inc.
US Patent
Assay Description
In the present assay, the activity of the test substances on human full-length PDE2A3 enzyme was determined using the [3H]-cGMP scintillation proximi...
US Patent US8829010 (2014)
BindingDB Entry DOI: 10.7270/Q2PR7TNH