null
SMILES: CN(C)C(=O)c1cc2[nH]c(=O)c3cnc(C4CCCCC4)n3c2cc1Cl
InChI Key: InChIKey=WMOSXRMMUWZZPL-UHFFFAOYSA-N
Activity Spreadsheet -- Enzyme Inhibition Constant Data from BindingDB
Found 2 hits for monomerid = 131010
Trg + Lig
Ki
nM
ΔG°
kcal/mole
IC50
nM
Kd
nM
EC50/IC50
nM
koff
s-1
kon
M-1s-1
pHTemp
°C
cGMP-specific 3',5'-cyclic phosphodiesterase
(Homo sapiens (Human))
BDBM131010
(US8829000, 85)
Show SMILES CN(C)C(=O)c1cc2[nH]c(=O)c3cnc(C4CCCCC4)n3c2cc1Cl
Show InChI InChI=1S/C19H21ClN4O2/c1-23(2)19(26)12-8-14-15(9-13(12)20)24-16(18(25)22-14)10-21-17(24)11-6-4-3-5-7-11/h8-11H,3-7H2,1-2H3,(H,22,25)
Reactome pathway
US Patent
n/an/a>1.00E+4n/an/an/an/an/a30
ASKA Pharmaceutical Co., Ltd.
US Patent
Assay Description
By a method similar to the measurement of PDE9-inhibiting activity, PDE5-inhibiting activity of each of the test compounds was measured, percent inhi...
US Patent US8829000 (2014)
BindingDB Entry DOI: 10.7270/Q2K072ZX
High affinity cGMP-specific 3',5'-cyclic phosphodiesterase 9A
(Homo sapiens (Human))
BDBM131010
(US8829000, 85)
Show SMILES CN(C)C(=O)c1cc2[nH]c(=O)c3cnc(C4CCCCC4)n3c2cc1Cl
Show InChI InChI=1S/C19H21ClN4O2/c1-23(2)19(26)12-8-14-15(9-13(12)20)24-16(18(25)22-14)10-21-17(24)11-6-4-3-5-7-11/h8-11H,3-7H2,1-2H3,(H,22,25)
US Patent
n/an/a 3n/an/an/an/an/a30
ASKA Pharmaceutical Co., Ltd.
US Patent
Assay Description
To 150 uL of buffer B (70 mmol/L Tris-HCl, pH7.5, 16.7 mmol/L MgCl2, 33.3 nmol/L [3H]-cGMP) solution containing [3H]-cGMP (specific activity=244.2 GB...
US Patent US8829000 (2014)
BindingDB Entry DOI: 10.7270/Q2K072ZX