BDBM13166 (2S)-1-[(2S)-3,3-dimethyl-2-[(2S)-2-(methylamino)propanamido]butanoyl]-N-[(1R)-1,2,3,4-tetrahydronaphthalen-1-yl]pyrrolidine-2-carboxamide::Capped Tripeptide Analog 2::H-N-Me-Ala-Tle-Pro-(R)-tetrahydronaphth-1-yl Amide
SMILES: CN[C@@H](C)C(=O)N[C@H](C(=O)N1CCC[C@H]1C(=O)N[C@@H]1CCCc2ccccc12)C(C)(C)C
InChI Key: InChIKey=JUJIMRZGUBTJRV-NASSWSRMSA-N
Data: 1 Kd
PDB links: 1 PDB ID matches this monomer. 1 PDB ID contains this monomer as substructures. 1 PDB ID contains inhibitors having a similarity of 90% to this monomer.
Activity Spreadsheet -- Enzyme Inhibition Constant Data from BindingDB
Found 1 hit for monomerid = 13166
Trg + Lig
Ki
nM
ΔG°
kcal/mole
IC50
nM
Kd
nM
EC50/IC50
nM
koff
s-1
kon
M-1s-1
pHTemp
°C
XIAP-BIR3
(Homo sapiens (Human))
BDBM13166
((2S)-1-[(2S)-3,3-dimethyl-2-[(2S)-2-(methylamino)p...)
Show SMILES CN[C@@H](C)C(=O)N[C@H](C(=O)N1CCC[C@H]1C(=O)N[C@@H]1CCCc2ccccc12)C(C)(C)C |r|
Show InChI InChI=1S/C25H38N4O3/c1-16(26-5)22(30)28-21(25(2,3)4)24(32)29-15-9-14-20(29)23(31)27-19-13-8-11-17-10-6-7-12-18(17)19/h6-7,10,12,16,19-21,26H,8-9,11,13-15H2,1-5H3,(H,27,31)(H,28,30)/t16-,19+,20-,21+/m0/s1
Reactome pathway
n/an/an/a 12n/an/an/a7.422
Abbott Laboratories
Assay Description
A fluorescence polarization anisotropy (FPA) competition assay was used to determine the affinities of compounds to BIR3 protein. Fluorescence polari...
J Med Chem 47: 4417-26 (2004)
Article DOI: 10.1021/jm040037k
BindingDB Entry DOI: 10.7270/Q27M065Q
3D
3D Structure (crystal)