BDBM132078 US8841453, 9
SMILES: CC(=O)NCCc1c[nH]c2ccc(OC(=O)NCCCCNc3c4CCCCc4nc4ccccc34)cc12
InChI Key: InChIKey=APIRGAOTKZFKAS-UHFFFAOYSA-N
Data: 2 IC50
Activity Spreadsheet -- Enzyme Inhibition Constant Data from BindingDB
Found 2 hits for monomerid = 132078
Trg + Lig
Ki
nM
ΔG°
kcal/mole
IC50
nM
Kd
nM
EC50/IC50
nM
koff
s-1
kon
M-1s-1
pHTemp
°C
Cholinesterases
(Homo sapiens (Human))
BDBM132078
(US8841453, 9)
Show SMILES CC(=O)NCCc1c[nH]c2ccc(OC(=O)NCCCCNc3c4CCCCc4nc4ccccc34)cc12
Show InChI InChI=1S/C30H35N5O3/c1-20(36)31-17-14-21-19-34-26-13-12-22(18-25(21)26)38-30(37)33-16-7-6-15-32-29-23-8-2-4-10-27(23)35-28-11-5-3-9-24(28)29/h2,4,8,10,12-13,18-19,34H,3,5-7,9,11,14-17H2,1H3,(H,31,36)(H,32,35)(H,33,37)
Reactome pathway
US Patent
n/an/a 15.5n/an/an/an/an/an/a
Uniwersytet Warszawski; Centrum Medyczne Ksztalcenia Podyplomowego
US Patent
Assay Description
The biological activity of the compounds of general formula (I) towards the cholinesterase inhibition was evaluated using Ellman's method (Ellman, G....
US Patent US8841453 (2014)
BindingDB Entry DOI: 10.7270/Q2W957VS
Acetylcholinesterase
(Homo sapiens (Human))
BDBM132078
(US8841453, 9)
Show SMILES CC(=O)NCCc1c[nH]c2ccc(OC(=O)NCCCCNc3c4CCCCc4nc4ccccc34)cc12
Show InChI InChI=1S/C30H35N5O3/c1-20(36)31-17-14-21-19-34-26-13-12-22(18-25(21)26)38-30(37)33-16-7-6-15-32-29-23-8-2-4-10-27(23)35-28-11-5-3-9-24(28)29/h2,4,8,10,12-13,18-19,34H,3,5-7,9,11,14-17H2,1H3,(H,31,36)(H,32,35)(H,33,37)
NCI pathway
Reactome pathway
US Patent
n/an/a 378n/an/an/an/an/an/a
Uniwersytet Warszawski; Centrum Medyczne Ksztalcenia Podyplomowego
US Patent
Assay Description
The biological activity of the compounds of general formula (I) towards the cholinesterase inhibition was evaluated using Ellman's method (Ellman, G....
US Patent US8841453 (2014)
BindingDB Entry DOI: 10.7270/Q2W957VS