BDBM13222 2-[[(Methoxy)carbonyl]-amino]-4-methyl-N-(2,4,6-trimethylphenyl)-1,3-thiazole-5-carboxamide::BMS-354825 2-Amino-4-methyl-thiazole Analog 7a::CHEMBL128589::methyl N-{4-methyl-5-[(2,4,6-trimethylphenyl)carbamoyl]-1,3-thiazol-2-yl}carbamate
SMILES: COC(=O)Nc1nc(C)c(s1)C(=O)Nc1c(C)cc(C)cc1C
InChI Key: InChIKey=VXSSRLZOYFLVBO-UHFFFAOYSA-N
Data: 4 IC50
Activity Spreadsheet -- Enzyme Inhibition Constant Data from BindingDB
Found 4 hits for monomerid = 13222
Trg + Lig
Ki
nM
ΔG°
kcal/mole
IC50
nM
Kd
nM
EC50/IC50
nM
koff
s-1
kon
M-1s-1
pHTemp
°C
Tyrosine-protein kinase Lck
(Homo sapiens (Human))
BDBM13222
(2-[[(Methoxy)carbonyl]-amino]-4-methyl-N-(2,4,6-tr...)
Show SMILES COC(=O)Nc1nc(C)c(s1)C(=O)Nc1c(C)cc(C)cc1C
Show InChI InChI=1S/C16H19N3O3S/c1-8-6-9(2)12(10(3)7-8)18-14(20)13-11(4)17-15(23-13)19-16(21)22-5/h6-7H,1-5H3,(H,18,20)(H,17,19,21)
n/an/a 700n/an/an/an/a7.022
Bristol-Myers Squibb Company
Assay Description
IC50 is the inhibitor concentration, which inhibits 50% of kinase activity that catalyzes the transfer of the terminal phosphate from [gamma-33P] lab...
J Med Chem 49: 6819-32 (2006)
Article DOI: 10.1021/jm060727j
BindingDB Entry DOI: 10.7270/Q2QN6501
Tyrosine-protein kinase LCK
(Mus musculus)
BDBM13222
(2-[[(Methoxy)carbonyl]-amino]-4-methyl-N-(2,4,6-tr...)
Show SMILES COC(=O)Nc1nc(C)c(s1)C(=O)Nc1c(C)cc(C)cc1C
Show InChI InChI=1S/C16H19N3O3S/c1-8-6-9(2)12(10(3)7-8)18-14(20)13-11(4)17-15(23-13)19-16(21)22-5/h6-7H,1-5H3,(H,18,20)(H,17,19,21)
Reactome pathway
n/an/a 720n/an/an/an/an/an/a
Bristol-Myers Squibb Pharmaceutical Research Institute
Curated by ChEMBL
Assay Description
In vitro inhibition of murine Lck kinase.
Bioorg Med Chem Lett 13: 4007-10 (2003)
BindingDB Entry DOI: 10.7270/Q2CC103J
Tyrosine-protein kinase Lck
(Homo sapiens (Human))
BDBM13222
(2-[[(Methoxy)carbonyl]-amino]-4-methyl-N-(2,4,6-tr...)
Show SMILES COC(=O)Nc1nc(C)c(s1)C(=O)Nc1c(C)cc(C)cc1C
Show InChI InChI=1S/C16H19N3O3S/c1-8-6-9(2)12(10(3)7-8)18-14(20)13-11(4)17-15(23-13)19-16(21)22-5/h6-7H,1-5H3,(H,18,20)(H,17,19,21)
n/an/a 700n/an/an/an/an/an/a
Bristol-Myers Squibb Pharmaceutical Research Institute
Curated by ChEMBL
Assay Description
Inhibitory activity of the compound human Lck(hLck) kinase
Bioorg Med Chem Lett 13: 4007-10 (2003)
BindingDB Entry DOI: 10.7270/Q2CC103J
Lck
(Mus musculus)
BDBM13222
(2-[[(Methoxy)carbonyl]-amino]-4-methyl-N-(2,4,6-tr...)
Show SMILES COC(=O)Nc1nc(C)c(s1)C(=O)Nc1c(C)cc(C)cc1C
Show InChI InChI=1S/C16H19N3O3S/c1-8-6-9(2)12(10(3)7-8)18-14(20)13-11(4)17-15(23-13)19-16(21)22-5/h6-7H,1-5H3,(H,18,20)(H,17,19,21)
Reactome pathway
n/an/a 720n/an/an/an/a7.022
Bristol-Myers Squibb Company
Assay Description
IC50 is the inhibitor concentration, which inhibits 50% of kinase activity that catalyzes the transfer of the terminal phosphate from [gamma-33P] lab...
J Med Chem 49: 6819-32 (2006)
Article DOI: 10.1021/jm060727j
BindingDB Entry DOI: 10.7270/Q2QN6501