BDBM132363 US8841312, 109
SMILES: N[C@@H]1CCN(C1)c1ccc(Nc2ncc3c(n2)n(C2CCCC2)c2cnccc32)nn1
InChI Key: InChIKey=FDNONPIMUKKMQB-CQSZACIVSA-N
Data: 2 IC50
Activity Spreadsheet -- Enzyme Inhibition Constant Data from BindingDB
Found 2 hits for monomerid = 132363
Trg + Lig
Ki
nM
ΔG°
kcal/mole
IC50
nM
Kd
nM
EC50/IC50
nM
koff
s-1
kon
M-1s-1
pHTemp
°C
Cyclin-dependent kinase 6
(Homo sapiens (Human))
BDBM132363
(US8841312, 109)
Show SMILES N[C@@H]1CCN(C1)c1ccc(Nc2ncc3c(n2)n(C2CCCC2)c2cnccc32)nn1 |r|
Show InChI InChI=1S/C22H25N9/c23-14-8-10-30(13-14)20-6-5-19(28-29-20)26-22-25-11-17-16-7-9-24-12-18(16)31(21(17)27-22)15-3-1-2-4-15/h5-7,9,11-12,14-15H,1-4,8,10,13,23H2,(H,25,26,27,28)/t14-/m1/s1
NCI pathway
Reactome pathway
US Patent
n/an/a 11n/an/an/an/a7.437
Amgen Inc.
US Patent
Assay Description
The Cdk4 and Cdk6 inhibitory activity of the compounds is measured with a kinase inhibition assay using recombinant Cdk4/CyclinD1 or Cdk6/CyclinD3 pr...
US Patent US8841312 (2014)
BindingDB Entry DOI: 10.7270/Q2H41Q4H
Cyclin-dependent kinase 4
(Homo sapiens (Human))
BDBM132363
(US8841312, 109)
Show SMILES N[C@@H]1CCN(C1)c1ccc(Nc2ncc3c(n2)n(C2CCCC2)c2cnccc32)nn1 |r|
Show InChI InChI=1S/C22H25N9/c23-14-8-10-30(13-14)20-6-5-19(28-29-20)26-22-25-11-17-16-7-9-24-12-18(16)31(21(17)27-22)15-3-1-2-4-15/h5-7,9,11-12,14-15H,1-4,8,10,13,23H2,(H,25,26,27,28)/t14-/m1/s1
NCI pathway
Reactome pathway
US Patent
n/an/a 1.90n/an/an/an/a7.437
Amgen Inc.
US Patent
Assay Description
The Cdk4 and Cdk6 inhibitory activity of the compounds is measured with a kinase inhibition assay using recombinant Cdk4/CyclinD1 or Cdk6/CyclinD3 pr...
US Patent US8841312 (2014)
BindingDB Entry DOI: 10.7270/Q2H41Q4H