BDBM132399 US8841312, 145
SMILES: CCN(CC)C1CCN(CC1)c1ccc(Nc2ncc3c4ccncc4n(C4CCCC4)c3n2)nn1
InChI Key: InChIKey=NOUVQMCOTSOPTN-UHFFFAOYSA-N
Data: 2 IC50
Activity Spreadsheet -- Enzyme Inhibition Constant Data from BindingDB
Found 2 hits for monomerid = 132399
Trg + Lig
Ki
nM
ΔG°
kcal/mole
IC50
nM
Kd
nM
EC50/IC50
nM
koff
s-1
kon
M-1s-1
pHTemp
°C
Cyclin-dependent kinase 6
(Homo sapiens (Human))
BDBM132399
(US8841312, 145)
Show SMILES CCN(CC)C1CCN(CC1)c1ccc(Nc2ncc3c4ccncc4n(C4CCCC4)c3n2)nn1
Show InChI InChI=1S/C27H35N9/c1-3-34(4-2)19-12-15-35(16-13-19)25-10-9-24(32-33-25)30-27-29-17-22-21-11-14-28-18-23(21)36(26(22)31-27)20-7-5-6-8-20/h9-11,14,17-20H,3-8,12-13,15-16H2,1-2H3,(H,29,30,31,32)
NCI pathway
Reactome pathway
US Patent
n/an/a 5.80n/an/an/an/a7.437
Amgen Inc.
US Patent
Assay Description
The Cdk4 and Cdk6 inhibitory activity of the compounds is measured with a kinase inhibition assay using recombinant Cdk4/CyclinD1 or Cdk6/CyclinD3 pr...
US Patent US8841312 (2014)
BindingDB Entry DOI: 10.7270/Q2H41Q4H
Cyclin-dependent kinase 4
(Homo sapiens (Human))
BDBM132399
(US8841312, 145)
Show SMILES CCN(CC)C1CCN(CC1)c1ccc(Nc2ncc3c4ccncc4n(C4CCCC4)c3n2)nn1
Show InChI InChI=1S/C27H35N9/c1-3-34(4-2)19-12-15-35(16-13-19)25-10-9-24(32-33-25)30-27-29-17-22-21-11-14-28-18-23(21)36(26(22)31-27)20-7-5-6-8-20/h9-11,14,17-20H,3-8,12-13,15-16H2,1-2H3,(H,29,30,31,32)
NCI pathway
Reactome pathway
US Patent
n/an/a 1n/an/an/an/a7.437
Amgen Inc.
US Patent
Assay Description
The Cdk4 and Cdk6 inhibitory activity of the compounds is measured with a kinase inhibition assay using recombinant Cdk4/CyclinD1 or Cdk6/CyclinD3 pr...
US Patent US8841312 (2014)
BindingDB Entry DOI: 10.7270/Q2H41Q4H