BDBM13244 2-[(benzylcarbamoyl)amino]-4-methyl-N-(2,4,6-trimethylphenyl)-1,3-thiazole-5-carboxamide::2-[[(Benzylamino)carbonyl]-amino]-4-methyl-N-(2,4,6-trimethylphenyl)-1,3-thiazole-5-carboxamide::BMS-354825 2-Amino-4-methyl-thiazole Analog 8e
SMILES: Cc1nc(NC(=O)NCc2ccccc2)sc1C(=O)Nc1c(C)cc(C)cc1C
InChI Key: InChIKey=NLYRFTNFPYEWCA-UHFFFAOYSA-N
Data: 2 IC50
Activity Spreadsheet -- Enzyme Inhibition Constant Data from BindingDB
Found 2 hits for monomerid = 13244
Trg + Lig
Ki
nM
ΔG°
kcal/mole
IC50
nM
Kd
nM
EC50/IC50
nM
koff
s-1
kon
M-1s-1
pHTemp
°C
Lck
(Mus musculus)
BDBM13244
(2-[(benzylcarbamoyl)amino]-4-methyl-N-(2,4,6-trime...)
Show SMILES Cc1nc(NC(=O)NCc2ccccc2)sc1C(=O)Nc1c(C)cc(C)cc1C
Show InChI InChI=1S/C22H24N4O2S/c1-13-10-14(2)18(15(3)11-13)25-20(27)19-16(4)24-22(29-19)26-21(28)23-12-17-8-6-5-7-9-17/h5-11H,12H2,1-4H3,(H,25,27)(H2,23,24,26,28)
Reactome pathway
n/an/a 100n/an/an/an/an/an/a
Bristol-Myers Squibb Company
Assay Description
IC50 is the inhibitor concentration, which inhibits 50% of kinase activity that catalyzes the transfer of the terminal phosphate from [gamma-33P] lab...
J Med Chem 49: 6819-32 (2006)
Article DOI: 10.1021/jm060727j
BindingDB Entry DOI: 10.7270/Q2QN6501
Tyrosine-protein kinase Lck
(Homo sapiens (Human))
BDBM13244
(2-[(benzylcarbamoyl)amino]-4-methyl-N-(2,4,6-trime...)
Show SMILES Cc1nc(NC(=O)NCc2ccccc2)sc1C(=O)Nc1c(C)cc(C)cc1C
Show InChI InChI=1S/C22H24N4O2S/c1-13-10-14(2)18(15(3)11-13)25-20(27)19-16(4)24-22(29-19)26-21(28)23-12-17-8-6-5-7-9-17/h5-11H,12H2,1-4H3,(H,25,27)(H2,23,24,26,28)
n/an/a 130n/an/an/an/an/an/a
Bristol-Myers Squibb Company
Assay Description
IC50 is the inhibitor concentration, which inhibits 50% of kinase activity that catalyzes the transfer of the terminal phosphate from [gamma-33P] lab...
J Med Chem 49: 6819-32 (2006)
Article DOI: 10.1021/jm060727j
BindingDB Entry DOI: 10.7270/Q2QN6501