BDBM13272 BMS-354825 2-Heteroarylamino-thiazole Analog 12q::N-(2-Chloro-6-methylphenyl)-2-(6-(3-morpholinopropylamino)pyridin-2-ylamino)-1,3-thiazole-5-carboxamide::N-(2-chloro-6-methylphenyl)-2-[(6-{[3-(morpholin-4-yl)propyl]amino}pyridin-2-yl)amino]-1,3-thiazole-5-carboxamide
SMILES: Cc1cccc(Cl)c1NC(=O)c1cnc(Nc2cccc(NCCCN3CCOCC3)n2)s1
InChI Key: InChIKey=VRDHUYBHXDZLDI-UHFFFAOYSA-N
Data: 1 IC50
Activity Spreadsheet -- Enzyme Inhibition Constant Data from BindingDB
Found 1 hit for monomerid = 13272
Trg + Lig
Ki
nM
ΔG°
kcal/mole
IC50
nM
Kd
nM
EC50/IC50
nM
koff
s-1
kon
M-1s-1
pHTemp
°C
Tyrosine-protein kinase Lck
(Homo sapiens (Human))
BDBM13272
(BMS-354825 2-Heteroarylamino-thiazole Analog 12q |...)
Show SMILES Cc1cccc(Cl)c1NC(=O)c1cnc(Nc2cccc(NCCCN3CCOCC3)n2)s1
Show InChI InChI=1S/C23H27ClN6O2S/c1-16-5-2-6-17(24)21(16)29-22(31)18-15-26-23(33-18)28-20-8-3-7-19(27-20)25-9-4-10-30-11-13-32-14-12-30/h2-3,5-8,15H,4,9-14H2,1H3,(H,29,31)(H2,25,26,27,28)
n/an/a 0.5n/an/an/an/an/an/a
Bristol-Myers Squibb Company
Assay Description
IC50 is the inhibitor concentration, which inhibits 50% of kinase activity that catalyzes the transfer of the terminal phosphate from [gamma-33P] lab...
J Med Chem 49: 6819-32 (2006)
Article DOI: 10.1021/jm060727j
BindingDB Entry DOI: 10.7270/Q2QN6501