BDBM132728 US8841312, 478
SMILES: OC(=O)CNC1CCN(CC1)c1ccc(Nc2ncc3c4ccncc4n(C4CCCC4)c3n2)nn1
InChI Key: InChIKey=NROJANSVZVKJQE-UHFFFAOYSA-N
Data: 2 IC50
Activity Spreadsheet -- Enzyme Inhibition Constant Data from BindingDB
Found 2 hits for monomerid = 132728
Trg + Lig
Ki
nM
ΔG°
kcal/mole
IC50
nM
Kd
nM
EC50/IC50
nM
koff
s-1
kon
M-1s-1
pHTemp
°C
Cyclin-dependent kinase 4
(Homo sapiens (Human))
BDBM132728
(US8841312, 478)
Show SMILES OC(=O)CNC1CCN(CC1)c1ccc(Nc2ncc3c4ccncc4n(C4CCCC4)c3n2)nn1
Show InChI InChI=1S/C25H29N9O2/c35-23(36)15-27-16-8-11-33(12-9-16)22-6-5-21(31-32-22)29-25-28-13-19-18-7-10-26-14-20(18)34(24(19)30-25)17-3-1-2-4-17/h5-7,10,13-14,16-17,27H,1-4,8-9,11-12,15H2,(H,35,36)(H,28,29,30,31)
NCI pathway
Reactome pathway
US Patent
n/an/a 2n/an/an/an/a7.437
Amgen Inc.
US Patent
Assay Description
The Cdk4 and Cdk6 inhibitory activity of the compounds is measured with a kinase inhibition assay using recombinant Cdk4/CyclinD1 or Cdk6/CyclinD3 pr...
US Patent US8841312 (2014)
BindingDB Entry DOI: 10.7270/Q2H41Q4H
Cyclin-dependent kinase 6
(Homo sapiens (Human))
BDBM132728
(US8841312, 478)
Show SMILES OC(=O)CNC1CCN(CC1)c1ccc(Nc2ncc3c4ccncc4n(C4CCCC4)c3n2)nn1
Show InChI InChI=1S/C25H29N9O2/c35-23(36)15-27-16-8-11-33(12-9-16)22-6-5-21(31-32-22)29-25-28-13-19-18-7-10-26-14-20(18)34(24(19)30-25)17-3-1-2-4-17/h5-7,10,13-14,16-17,27H,1-4,8-9,11-12,15H2,(H,35,36)(H,28,29,30,31)
NCI pathway
Reactome pathway
US Patent
n/an/a 5.70n/an/an/an/a7.437
Amgen Inc.
US Patent
Assay Description
The Cdk4 and Cdk6 inhibitory activity of the compounds is measured with a kinase inhibition assay using recombinant Cdk4/CyclinD1 or Cdk6/CyclinD3 pr...
US Patent US8841312 (2014)
BindingDB Entry DOI: 10.7270/Q2H41Q4H