BDBM13307 1-Methyl-1H-imidazole-4-sulfonic Acid Benzyl-{2-[(4-cyanophenyl)-(3-methyl-3H-imidazol-4-ylmethyl)amino]ethyl}amide::Chem Biol Compound 2::N-benzyl-N-{2-[(4-cyanophenyl)[(1-methyl-1H-imidazol-5-yl)methyl]amino]ethyl}-1-methyl-1H-imidazole-4-sulfonamide::Sulfonamide 12d
SMILES: Cn1cnc(c1)S(=O)(=O)N(CCN(Cc1cncn1C)c1ccc(cc1)C#N)Cc1ccccc1
InChI Key: InChIKey=IDHGAQOVWWBGFK-UHFFFAOYSA-N
Data: 8 IC50
PDB links: 2 PDB IDs match this monomer.
Activity Spreadsheet -- Enzyme Inhibition Constant Data from BindingDB
Found 8 hits for monomerid = 13307
Trg + Lig
Ki
nM
ΔG°
kcal/mole
IC50
nM
Kd
nM
EC50/IC50
nM
koff
s-1
kon
M-1s-1
pHTemp
°C
Protein Farnesyltransferase (PFT)
(Plasmodium falciparum (malaria parasite P. falcipa...)
BDBM13307
(1-Methyl-1H-imidazole-4-sulfonic Acid Benzyl-{2-[(...)
Show SMILES Cn1cnc(c1)S(=O)(=O)N(CCN(Cc1cncn1C)c1ccc(cc1)C#N)Cc1ccccc1
Show InChI InChI=1S/C25H27N7O2S/c1-29-18-25(28-20-29)35(33,34)32(16-22-6-4-3-5-7-22)13-12-31(17-24-15-27-19-30(24)2)23-10-8-21(14-26)9-11-23/h3-11,15,18-20H,12-13,16-17H2,1-2H3
n/an/a 0.5n/an/an/an/a7.537
Yale University
Assay Description
Assays for PFT activity were performed with a PFT-specific scintillation assay (SPA) kit (Amersham Biosciences, Piscataway, NJ). IC50 values were cal...
J Med Chem 49: 5710-27 (2006)
Article DOI: 10.1021/jm060081v
BindingDB Entry DOI: 10.7270/Q2G44NJW
Protein farnesyltransferase
(Rattus norvegicus (rat))
BDBM13307
(1-Methyl-1H-imidazole-4-sulfonic Acid Benzyl-{2-[(...)
Show SMILES Cn1cnc(c1)S(=O)(=O)N(CCN(Cc1cncn1C)c1ccc(cc1)C#N)Cc1ccccc1
Show InChI InChI=1S/C25H27N7O2S/c1-29-18-25(28-20-29)35(33,34)32(16-22-6-4-3-5-7-22)13-12-31(17-24-15-27-19-30(24)2)23-10-8-21(14-26)9-11-23/h3-11,15,18-20H,12-13,16-17H2,1-2H3
n/an/a 25n/an/an/an/a7.537
Yale University
Assay Description
Assays for PFT activity were performed with a PFT-specific scintillation assay (SPA) kit (Amersham Biosciences, Piscataway, NJ). IC50 values were cal...
J Med Chem 49: 5710-27 (2006)
Article DOI: 10.1021/jm060081v
BindingDB Entry DOI: 10.7270/Q2G44NJW
3D
3D Structure (crystal)
Protein Farnesyltransferase (PFT)
(Homo sapiens (Human))
BDBM13307
(1-Methyl-1H-imidazole-4-sulfonic Acid Benzyl-{2-[(...)
Show SMILES Cn1cnc(c1)S(=O)(=O)N(CCN(Cc1cncn1C)c1ccc(cc1)C#N)Cc1ccccc1
Show InChI InChI=1S/C25H27N7O2S/c1-29-18-25(28-20-29)35(33,34)32(16-22-6-4-3-5-7-22)13-12-31(17-24-15-27-19-30(24)2)23-10-8-21(14-26)9-11-23/h3-11,15,18-20H,12-13,16-17H2,1-2H3
Reactome pathway
n/an/a 56n/an/an/an/a7.730
Duke University Medical Center
Assay Description
In vitro inhibition assay of human PFT was done by measuring the incorporation of [3H] FPP (Amersham Biosciences, Piscataway, NJ) into wild type H-Ra...
Chem Biol 16: 181-92 (2009)
Article DOI: 10.1016/j.chembiol.2009.01.014
BindingDB Entry DOI: 10.7270/Q22F7KR8
3D
3D Structure (crystal)
Geranylgeranyl transferase type I beta subunit/Protein Farnesyltransferase (PFT)
(Homo sapiens (Human))
BDBM13307
(1-Methyl-1H-imidazole-4-sulfonic Acid Benzyl-{2-[(...)
Show SMILES Cn1cnc(c1)S(=O)(=O)N(CCN(Cc1cncn1C)c1ccc(cc1)C#N)Cc1ccccc1
Show InChI InChI=1S/C25H27N7O2S/c1-29-18-25(28-20-29)35(33,34)32(16-22-6-4-3-5-7-22)13-12-31(17-24-15-27-19-30(24)2)23-10-8-21(14-26)9-11-23/h3-11,15,18-20H,12-13,16-17H2,1-2H3
n/an/a 2.70E+3n/an/an/an/an/an/a
Yale University
Curated by ChEMBL
Assay Description
Inhibition of human geranylgeranyltransferase-1 assessed as incorporation of [3H]GGPP into H-Ras-CVLL
J Med Chem 53: 6867-88 (2010)
Article DOI: 10.1021/jm1001748
BindingDB Entry DOI: 10.7270/Q26110JC
3D
3D Structure (crystal)
Protein farnesyltransferase beta/geranylgeranyltransferase type I alpha subunit
(Mus musculus)
BDBM13307
(1-Methyl-1H-imidazole-4-sulfonic Acid Benzyl-{2-[(...)
Show SMILES Cn1cnc(c1)S(=O)(=O)N(CCN(Cc1cncn1C)c1ccc(cc1)C#N)Cc1ccccc1
Show InChI InChI=1S/C25H27N7O2S/c1-29-18-25(28-20-29)35(33,34)32(16-22-6-4-3-5-7-22)13-12-31(17-24-15-27-19-30(24)2)23-10-8-21(14-26)9-11-23/h3-11,15,18-20H,12-13,16-17H2,1-2H3
n/an/a 1.90E+3n/an/an/an/an/an/a
Yale University
Curated by ChEMBL
Assay Description
Inhibition of H-Ras farnesylation expressed in mouse NIH3T3 cells
J Med Chem 53: 6867-88 (2010)
Article DOI: 10.1021/jm1001748
BindingDB Entry DOI: 10.7270/Q26110JC
3D
3D Structure (crystal)
Protein Farnesyltransferase (PFT)
(Homo sapiens (Human))
BDBM13307
(1-Methyl-1H-imidazole-4-sulfonic Acid Benzyl-{2-[(...)
Show SMILES Cn1cnc(c1)S(=O)(=O)N(CCN(Cc1cncn1C)c1ccc(cc1)C#N)Cc1ccccc1
Show InChI InChI=1S/C25H27N7O2S/c1-29-18-25(28-20-29)35(33,34)32(16-22-6-4-3-5-7-22)13-12-31(17-24-15-27-19-30(24)2)23-10-8-21(14-26)9-11-23/h3-11,15,18-20H,12-13,16-17H2,1-2H3
Reactome pathway
n/an/a 56n/an/an/an/an/an/a
Yale University
Curated by ChEMBL
Assay Description
Inhibition of human farnesyltransferase assessed as incorporation of [3H]FPP into H-Ras-CVLS
J Med Chem 53: 6867-88 (2010)
Article DOI: 10.1021/jm1001748
BindingDB Entry DOI: 10.7270/Q26110JC
3D
3D Structure (crystal)
Geranylgeranyl transferase type 1
(Mus musculus)
BDBM13307
(1-Methyl-1H-imidazole-4-sulfonic Acid Benzyl-{2-[(...)
Show SMILES Cn1cnc(c1)S(=O)(=O)N(CCN(Cc1cncn1C)c1ccc(cc1)C#N)Cc1ccccc1
Show InChI InChI=1S/C25H27N7O2S/c1-29-18-25(28-20-29)35(33,34)32(16-22-6-4-3-5-7-22)13-12-31(17-24-15-27-19-30(24)2)23-10-8-21(14-26)9-11-23/h3-11,15,18-20H,12-13,16-17H2,1-2H3
n/an/a>1.00E+4n/an/an/an/an/an/a
Yale University
Curated by ChEMBL
Assay Description
Inhibition of Rap1A-mediated geranylgeranylation expressed in mouse NIH3T3 cells
J Med Chem 53: 6867-88 (2010)
Article DOI: 10.1021/jm1001748
BindingDB Entry DOI: 10.7270/Q26110JC
3D
3D Structure (crystal)
Protein Farnesyltransferase (PFT)
(Plasmodium falciparum (malaria parasite P. falcipa...)
BDBM13307
(1-Methyl-1H-imidazole-4-sulfonic Acid Benzyl-{2-[(...)
Show SMILES Cn1cnc(c1)S(=O)(=O)N(CCN(Cc1cncn1C)c1ccc(cc1)C#N)Cc1ccccc1
Show InChI InChI=1S/C25H27N7O2S/c1-29-18-25(28-20-29)35(33,34)32(16-22-6-4-3-5-7-22)13-12-31(17-24-15-27-19-30(24)2)23-10-8-21(14-26)9-11-23/h3-11,15,18-20H,12-13,16-17H2,1-2H3
n/an/a 0.5n/an/an/an/a7.537
Duke University Medical Center
Assay Description
Assays for PfPFT activity were performed with a PFT-specific scintillation assay (SPA) kit (Amersham Biosciences, Piscataway, NJ). An amount of 1 uM ...
Chem Biol 16: 181-92 (2009)
Article DOI: 10.1016/j.chembiol.2009.01.014
BindingDB Entry DOI: 10.7270/Q22F7KR8