BDBM13319 BMS-386914::CHEMBL183536::[[6-Cyano-1-(3-methyl-3H-imidazol-4-ylmethyl)-1,2,3,4-tetrahydroquinolin-3-yl]-(1-methyl-1H-imidazole-4-sulfonyl)amino]-acetic Acid tert-Butyl Ester::tert-butyl 2-({6-cyano-1-[(1-methyl-1H-imidazol-5-yl)methyl]-1,2,3,4-tetrahydroquinolin-3-yl}(1-methyl-1H-imidazole-4-)sulfonamido)acetate::tetrahydroquinoline (THQ)-based inhibitor 4a
SMILES: Cn1cnc(c1)S(=O)(=O)N(CC(=O)OC(C)(C)C)C1CN(Cc2cncn2C)c2ccc(cc2C1)C#N
InChI Key: InChIKey=NLCBWQRVYLSINY-UHFFFAOYSA-N
Data: 4 IC50
PDB links: 1 PDB ID contains inhibitors having a similarity of 90% to this monomer.
Activity Spreadsheet -- Enzyme Inhibition Constant Data from BindingDB
Found 4 hits for monomerid = 13319
Trg + Lig
Ki
nM
ΔG°
kcal/mole
IC50
nM
Kd
nM
EC50/IC50
nM
koff
s-1
kon
M-1s-1
pHTemp
°C
Protein Farnesyltransferase (PFT)
(Plasmodium falciparum (malaria parasite P. falcipa...)
BDBM13319
(BMS-386914 | CHEMBL183536 | [[6-Cyano-1-(3-methyl-...)
Show SMILES Cn1cnc(c1)S(=O)(=O)N(CC(=O)OC(C)(C)C)C1CN(Cc2cncn2C)c2ccc(cc2C1)C#N
Show InChI InChI=1S/C25H31N7O4S/c1-25(2,3)36-24(33)15-32(37(34,35)23-14-29(4)17-28-23)20-9-19-8-18(10-26)6-7-22(19)31(12-20)13-21-11-27-16-30(21)5/h6-8,11,14,16-17,20H,9,12-13,15H2,1-5H3
n/an/a 0.900n/an/an/an/a7.537
University of Washington at Seattle
Assay Description
Assays for PFT activity were performed with a PFT-specific scintillation assay (SPA) kit (Amersham Biosciences, Piscataway, NJ). IC50 values were cal...
J Med Chem 48: 3704-13 (2005)
Article DOI: 10.1021/jm0491039
BindingDB Entry DOI: 10.7270/Q2BC3WSQ
Protein Farnesyltransferase (PFT)
(Homo sapiens (Human))
BDBM13319
(BMS-386914 | CHEMBL183536 | [[6-Cyano-1-(3-methyl-...)
Show SMILES Cn1cnc(c1)S(=O)(=O)N(CC(=O)OC(C)(C)C)C1CN(Cc2cncn2C)c2ccc(cc2C1)C#N
Show InChI InChI=1S/C25H31N7O4S/c1-25(2,3)36-24(33)15-32(37(34,35)23-14-29(4)17-28-23)20-9-19-8-18(10-26)6-7-22(19)31(12-20)13-21-11-27-16-30(21)5/h6-8,11,14,16-17,20H,9,12-13,15H2,1-5H3
Reactome pathway
n/an/a 0.600n/an/an/an/an/an/a
Bristol-Myers Squibb Pharmaceutical Research Institute
Curated by ChEMBL
Assay Description
Inhibition of human farnesyltransferase
Bioorg Med Chem Lett 15: 1895-9 (2005)
Article DOI: 10.1016/j.bmcl.2005.02.004
BindingDB Entry DOI: 10.7270/Q2RB75CJ
Protein Farnesyltransferase (PFT)/farnesyltransferase beta subunit
(Rattus norvegicus-Rattus norvegicus (rat))
BDBM13319
(BMS-386914 | CHEMBL183536 | [[6-Cyano-1-(3-methyl-...)
Show SMILES Cn1cnc(c1)S(=O)(=O)N(CC(=O)OC(C)(C)C)C1CN(Cc2cncn2C)c2ccc(cc2C1)C#N
Show InChI InChI=1S/C25H31N7O4S/c1-25(2,3)36-24(33)15-32(37(34,35)23-14-29(4)17-28-23)20-9-19-8-18(10-26)6-7-22(19)31(12-20)13-21-11-27-16-30(21)5/h6-8,11,14,16-17,20H,9,12-13,15H2,1-5H3
n/an/a 30n/an/an/an/an/an/a
Bristol-Myers Squibb Pharmaceutical Research Institute
Curated by ChEMBL
Assay Description
Inhibition of cellular reversion in H-ras transformed Rat-1 cells
Bioorg Med Chem Lett 15: 1895-9 (2005)
Article DOI: 10.1016/j.bmcl.2005.02.004
BindingDB Entry DOI: 10.7270/Q2RB75CJ
Protein farnesyltransferase
(Rattus norvegicus (rat))
BDBM13319
(BMS-386914 | CHEMBL183536 | [[6-Cyano-1-(3-methyl-...)
Show SMILES Cn1cnc(c1)S(=O)(=O)N(CC(=O)OC(C)(C)C)C1CN(Cc2cncn2C)c2ccc(cc2C1)C#N
Show InChI InChI=1S/C25H31N7O4S/c1-25(2,3)36-24(33)15-32(37(34,35)23-14-29(4)17-28-23)20-9-19-8-18(10-26)6-7-22(19)31(12-20)13-21-11-27-16-30(21)5/h6-8,11,14,16-17,20H,9,12-13,15H2,1-5H3
n/an/a 1.20n/an/an/an/an/an/a
University of Washington at Seattle
Assay Description
Assays for PFT activity were performed with a PFT-specific scintillation assay (SPA) kit (Amersham Biosciences, Piscataway, NJ). IC50 values were cal...
J Med Chem 48: 3704-13 (2005)
Article DOI: 10.1021/jm0491039
BindingDB Entry DOI: 10.7270/Q2BC3WSQ