BDBM133518 US8846719, 208
SMILES: CC[C@@H](CO)NC(=O)c1ccc(OCc2c(C)onc2-c2ccccc2)nc1
InChI Key: InChIKey=IHBDJLQRENXTKF-KRWDZBQOSA-N
Data: 1 KI
Activity Spreadsheet -- Enzyme Inhibition Constant Data from BindingDB
Found 1 hit for monomerid = 133518
Trg + Lig
Ki
nM
ΔG°
kcal/mole
IC50
nM
Kd
nM
EC50/IC50
nM
koff
s-1
kon
M-1s-1
pHTemp
°C
Gamma-aminobutyric acid receptor subunit alpha-5 (GABA(A))
(Homo sapiens (Human))
BDBM133518
(US8846719, 208)
Show SMILES CC[C@@H](CO)NC(=O)c1ccc(OCc2c(C)onc2-c2ccccc2)nc1
Show InChI InChI=1S/C21H23N3O4/c1-3-17(12-25)23-21(26)16-9-10-19(22-11-16)27-13-18-14(2)28-24-20(18)15-7-5-4-6-8-15/h4-11,17,25H,3,12-13H2,1-2H3,(H,23,26)/t17-/m0/s1
Reactome pathway
US Patent
0.700 -11.6n/an/an/an/an/a7.54
Roche Palo Alto LLC
US Patent
Assay Description
Radioligand binding assays were carried out in a volume of 200 mL (96-well plates) which contained 100 mL of cell memebranes, [3H]flumazenil at a con...
US Patent US8846719 (2014)
BindingDB Entry DOI: 10.7270/Q2V986RV