BDBM13356 CHEMBL84624::N-(2-chloro-6-methylphenyl)-2-[(2,6-dimethylpyrimidin-4-yl)amino]-1,3-benzothiazole-6-carboxamide::benzothiazole analog 13
SMILES: Cc1cc(Nc2nc3ccc(cc3s2)C(=O)Nc2c(C)cccc2Cl)nc(C)n1
InChI Key: InChIKey=MPSLLCQEAHPHNF-UHFFFAOYSA-N
Data: 2 IC50
Activity Spreadsheet -- Enzyme Inhibition Constant Data from BindingDB
Found 2 hits for monomerid = 13356
Trg + Lig
Ki
nM
ΔG°
kcal/mole
IC50
nM
Kd
nM
EC50/IC50
nM
koff
s-1
kon
M-1s-1
pHTemp
°C
Tyrosine-protein kinase Lck
(Homo sapiens (Human))
BDBM13356
(CHEMBL84624 | N-(2-chloro-6-methylphenyl)-2-[(2,6-...)
Show SMILES Cc1cc(Nc2nc3ccc(cc3s2)C(=O)Nc2c(C)cccc2Cl)nc(C)n1
Show InChI InChI=1S/C21H18ClN5OS/c1-11-5-4-6-15(22)19(11)27-20(28)14-7-8-16-17(10-14)29-21(25-16)26-18-9-12(2)23-13(3)24-18/h4-10H,1-3H3,(H,27,28)(H,23,24,25,26)
n/an/a 20n/an/an/an/an/an/a
Bristol-Myers Squibb Pharmaceutical Research Institute
Curated by ChEMBL
Assay Description
Inhibition of human p56 Lck tyrosine kinase
Bioorg Med Chem Lett 13: 2587-90 (2003)
BindingDB Entry DOI: 10.7270/Q2FX78V4
Tyrosine-protein kinase Lck
(Homo sapiens (Human))
BDBM13356
(CHEMBL84624 | N-(2-chloro-6-methylphenyl)-2-[(2,6-...)
Show SMILES Cc1cc(Nc2nc3ccc(cc3s2)C(=O)Nc2c(C)cccc2Cl)nc(C)n1
Show InChI InChI=1S/C21H18ClN5OS/c1-11-5-4-6-15(22)19(11)27-20(28)14-7-8-16-17(10-14)29-21(25-16)26-18-9-12(2)23-13(3)24-18/h4-10H,1-3H3,(H,27,28)(H,23,24,25,26)
n/an/a 20n/an/an/an/an/an/a
Bristol-Myers Squibb Company
Assay Description
IC50 is the inhibitor concentration, which inhibits 50% of kinase activity that catalyzes the transfer of the terminal phosphate from [gamma-33P] lab...
J Med Chem 49: 6819-32 (2006)
Article DOI: 10.1021/jm060727j
BindingDB Entry DOI: 10.7270/Q2QN6501