BDBM133561 US8846719, 253
SMILES: CC(C)NC(=O)c1ccc(OCc2c(C)onc2-c2ccc(C)cc2F)nc1
InChI Key: InChIKey=YEUNIVCDHKRIML-UHFFFAOYSA-N
Data: 1 KI
Activity Spreadsheet -- Enzyme Inhibition Constant Data from BindingDB
Found 1 hit for monomerid = 133561
Trg + Lig
Ki
nM
ΔG°
kcal/mole
IC50
nM
Kd
nM
EC50/IC50
nM
koff
s-1
kon
M-1s-1
pHTemp
°C
Gamma-aminobutyric acid receptor subunit alpha-5 (GABA(A))
(Homo sapiens (Human))
BDBM133561
(US8846719, 253)
Show SMILES CC(C)NC(=O)c1ccc(OCc2c(C)onc2-c2ccc(C)cc2F)nc1
Show InChI InChI=1S/C21H22FN3O3/c1-12(2)24-21(26)15-6-8-19(23-10-15)27-11-17-14(4)28-25-20(17)16-7-5-13(3)9-18(16)22/h5-10,12H,11H2,1-4H3,(H,24,26)
Reactome pathway
US Patent
0.800 -11.5n/an/an/an/an/a7.54
Roche Palo Alto LLC
US Patent
Assay Description
Radioligand binding assays were carried out in a volume of 200 mL (96-well plates) which contained 100 mL of cell memebranes, [3H]flumazenil at a con...
US Patent US8846719 (2014)
BindingDB Entry DOI: 10.7270/Q2V986RV