BDBM13358 (2S)-2-{[(2R)-1-[(2S)-2-[(2R)-2-amino-3-sulfanylpropanamido]-3-methylbutanoyl]-octahydro-1H-indol-2-yl]formamido}-4-(methylsulfanyl)butanoic acid::CAAX Analogue 1::Compound I
SMILES: CSCC[C@H](NC(=O)[C@H]1CC2CCCCC2N1C(=O)[C@@H](NC(=O)[C@@H](N)CS)C(C)C)C(O)=O
InChI Key: InChIKey=YFAURVKAEFCMHI-YYQWJSNHSA-N
Data: 1 IC50
Activity Spreadsheet -- Enzyme Inhibition Constant Data from BindingDB
Found 1 hit for monomerid = 13358
Trg + Lig
Ki
nM
ΔG°
kcal/mole
IC50
nM
Kd
nM
EC50/IC50
nM
koff
s-1
kon
M-1s-1
pHTemp
°C
Protein farnesyltransferase
(Bos taurus (bovine))
BDBM13358
((2S)-2-{[(2R)-1-[(2S)-2-[(2R)-2-amino-3-sulfanylpr...)
Show SMILES CSCC[C@H](NC(=O)[C@H]1CC2CCCCC2N1C(=O)[C@@H](NC(=O)[C@@H](N)CS)C(C)C)C(O)=O |r|
Show InChI InChI=1S/C22H38N4O5S2/c1-12(2)18(25-19(27)14(23)11-32)21(29)26-16-7-5-4-6-13(16)10-17(26)20(28)24-15(22(30)31)8-9-33-3/h12-18,32H,4-11,23H2,1-3H3,(H,24,28)(H,25,27)(H,30,31)/t13?,14-,15-,16?,17+,18-/m0/s1
n/an/a 1.00E+3n/an/an/an/a7.537
Universita di Napoli Federico II
Assay Description
Assays for PFT activity were performed with a PFT-specific scintillation assay (SPA) kit (Amersham Biosciences, Piscataway, NJ). IC50 values were cal...
J Med Chem 49: 1882-90 (2006)
Article DOI: 10.1021/jm0506165
BindingDB Entry DOI: 10.7270/Q22V2DCH