BDBM133701 US8846699, 17
SMILES: CNCCCOc1cc2ncnc(Nc3ccc(Br)cc3F)c2cc1NC(=O)C=C
InChI Key: InChIKey=NFWFBDDHXYCYHP-UHFFFAOYSA-N
Data: 2 IC50
Activity Spreadsheet -- Enzyme Inhibition Constant Data from BindingDB
Found 2 hits for monomerid = 133701
Trg + Lig
Ki
nM
ΔG°
kcal/mole
IC50
nM
Kd
nM
EC50/IC50
nM
koff
s-1
kon
M-1s-1
pHTemp
°C
Epidermal growth factor receptor
(Homo sapiens (Human))
BDBM133701
(US8846699, 17)
Show SMILES CNCCCOc1cc2ncnc(Nc3ccc(Br)cc3F)c2cc1NC(=O)C=C
Show InChI InChI=1S/C21H21BrFN5O2/c1-3-20(29)27-18-10-14-17(11-19(18)30-8-4-7-24-2)25-12-26-21(14)28-16-6-5-13(22)9-15(16)23/h3,5-6,9-12,24H,1,4,7-8H2,2H3,(H,27,29)(H,25,26,28)
US Patent
n/an/a 3n/an/an/an/a7.425
Hanmi Pharm. Co., Ltd.
US Patent
Assay Description
EGFR1 (HER-1) enzyme assay was carried out by using Tyrosine Kinase Assay Kit Green. The entire assay was conducted in accordance with EGFR PTK inhib...
US Patent US8846699 (2014)
BindingDB Entry DOI: 10.7270/Q2KW5DRK
Vascular endothelial growth factor receptor 2
(Homo sapiens (Human))
BDBM133701
(US8846699, 17)
Show SMILES CNCCCOc1cc2ncnc(Nc3ccc(Br)cc3F)c2cc1NC(=O)C=C
Show InChI InChI=1S/C21H21BrFN5O2/c1-3-20(29)27-18-10-14-17(11-19(18)30-8-4-7-24-2)25-12-26-21(14)28-16-6-5-13(22)9-15(16)23/h3,5-6,9-12,24H,1,4,7-8H2,2H3,(H,27,29)(H,25,26,28)
NCI pathway
Reactome pathway
US Patent
n/an/a 154n/an/an/an/a7.425
Hanmi Pharm. Co., Ltd.
US Patent
Assay Description
VEGFR2 (KDR, Proquinase) enzyme assay (auto-phosphorylation assay) was carried out by using Tyrosine Kinase Assay Kit Green (Panvera). The entire ass...
US Patent US8846699 (2014)
BindingDB Entry DOI: 10.7270/Q2KW5DRK