BDBM133708 US8846699, 24
SMILES: NC(=O)NCCOc1cc2ncnc(Nc3ccc(Br)cc3F)c2cc1NC(=O)C=C
InChI Key: InChIKey=YMDWARQKAFASNA-UHFFFAOYSA-N
Data: 2 IC50
Activity Spreadsheet -- Enzyme Inhibition Constant Data from BindingDB
Found 2 hits for monomerid = 133708
Trg + Lig
Ki
nM
ΔG°
kcal/mole
IC50
nM
Kd
nM
EC50/IC50
nM
koff
s-1
kon
M-1s-1
pHTemp
°C
Epidermal growth factor receptor
(Homo sapiens (Human))
BDBM133708
(US8846699, 24)
Show SMILES NC(=O)NCCOc1cc2ncnc(Nc3ccc(Br)cc3F)c2cc1NC(=O)C=C
Show InChI InChI=1S/C20H18BrFN6O3/c1-2-18(29)27-16-8-12-15(9-17(16)31-6-5-24-20(23)30)25-10-26-19(12)28-14-4-3-11(21)7-13(14)22/h2-4,7-10H,1,5-6H2,(H,27,29)(H3,23,24,30)(H,25,26,28)
US Patent
n/an/a 4n/an/an/an/a7.425
Hanmi Pharm. Co., Ltd.
US Patent
Assay Description
EGFR1 (HER-1) enzyme assay was carried out by using Tyrosine Kinase Assay Kit Green. The entire assay was conducted in accordance with EGFR PTK inhib...
US Patent US8846699 (2014)
BindingDB Entry DOI: 10.7270/Q2KW5DRK
Vascular endothelial growth factor receptor 2
(Homo sapiens (Human))
BDBM133708
(US8846699, 24)
Show SMILES NC(=O)NCCOc1cc2ncnc(Nc3ccc(Br)cc3F)c2cc1NC(=O)C=C
Show InChI InChI=1S/C20H18BrFN6O3/c1-2-18(29)27-16-8-12-15(9-17(16)31-6-5-24-20(23)30)25-10-26-19(12)28-14-4-3-11(21)7-13(14)22/h2-4,7-10H,1,5-6H2,(H,27,29)(H3,23,24,30)(H,25,26,28)
NCI pathway
Reactome pathway
US Patent
n/an/a 250n/an/an/an/a7.425
Hanmi Pharm. Co., Ltd.
US Patent
Assay Description
VEGFR2 (KDR, Proquinase) enzyme assay (auto-phosphorylation assay) was carried out by using Tyrosine Kinase Assay Kit Green (Panvera). The entire ass...
US Patent US8846699 (2014)
BindingDB Entry DOI: 10.7270/Q2KW5DRK