BDBM13380 4-{[(4-cyanophenyl)(1-methyl-1H-imidazol-5-yl)methoxy]methyl}-3-(naphthalen-1-yl)benzonitrile::A313326 Analogue 16
SMILES: Cn1cncc1C(OCc1ccc(cc1-c1cccc2ccccc12)C#N)c1ccc(cc1)C#N
InChI Key: InChIKey=VHFURXMPOXMFQR-UHFFFAOYSA-N
Data: 3 IC50
Activity Spreadsheet -- Enzyme Inhibition Constant Data from BindingDB
Found 3 hits for monomerid = 13380
Trg + Lig
Ki
nM
ΔG°
kcal/mole
IC50
nM
Kd
nM
EC50/IC50
nM
koff
s-1
kon
M-1s-1
pHTemp
°C
Protein farnesyl/geranylgeranyl transferase
(Homo sapiens (Human))
BDBM13380
(4-{[(4-cyanophenyl)(1-methyl-1H-imidazol-5-yl)meth...)
Show SMILES Cn1cncc1C(OCc1ccc(cc1-c1cccc2ccccc12)C#N)c1ccc(cc1)C#N
Show InChI InChI=1S/C30H22N4O/c1-34-20-33-18-29(34)30(24-12-9-21(16-31)10-13-24)35-19-25-14-11-22(17-32)15-28(25)27-8-4-6-23-5-2-3-7-26(23)27/h2-15,18,20,30H,19H2,1H3
Reactome pathway
n/an/a 0.940n/an/an/an/a7.037
Globe Pharmaceutical R and Abbott Laboratories
Assay Description
The in vitro activity of compounds inhibiting FTase or GGTase-I was determined by using scintillation proximity assay (SPA) technology. The assays we...
J Med Chem 47: 612-26 (2004)
Article DOI: 10.1021/jm030434f
BindingDB Entry DOI: 10.7270/Q2Z60M8D
Protein Farnesyltransferase (PFT)
(Homo sapiens (Human))
BDBM13380
(4-{[(4-cyanophenyl)(1-methyl-1H-imidazol-5-yl)meth...)
Show SMILES Cn1cncc1C(OCc1ccc(cc1-c1cccc2ccccc12)C#N)c1ccc(cc1)C#N
Show InChI InChI=1S/C30H22N4O/c1-34-20-33-18-29(34)30(24-12-9-21(16-31)10-13-24)35-19-25-14-11-22(17-32)15-28(25)27-8-4-6-23-5-2-3-7-26(23)27/h2-15,18,20,30H,19H2,1H3
Reactome pathway
n/an/a 955n/an/an/an/an/an/a
The M.S. University of Baroda
Curated by ChEMBL
Assay Description
Inhibition of FTase
Bioorg Med Chem Lett 16: 1821-7 (2006)
Article DOI: 10.1016/j.bmcl.2006.01.019
BindingDB Entry DOI: 10.7270/Q2W66PJG
Geranylgeranyl transferase type I
(Bos taurus (bovine))
BDBM13380
(4-{[(4-cyanophenyl)(1-methyl-1H-imidazol-5-yl)meth...)
Show SMILES Cn1cncc1C(OCc1ccc(cc1-c1cccc2ccccc12)C#N)c1ccc(cc1)C#N
Show InChI InChI=1S/C30H22N4O/c1-34-20-33-18-29(34)30(24-12-9-21(16-31)10-13-24)35-19-25-14-11-22(17-32)15-28(25)27-8-4-6-23-5-2-3-7-26(23)27/h2-15,18,20,30H,19H2,1H3
n/an/a 7.60E+3n/an/an/an/an/an/a
Globe Pharmaceutical R and Abbott Laboratories
Assay Description
The in vitro activity of compounds inhibiting FTase or GGTase-I was determined by using scintillation proximity assay (SPA) technology. The assays we...
J Med Chem 47: 612-26 (2004)
Article DOI: 10.1021/jm030434f
BindingDB Entry DOI: 10.7270/Q2Z60M8D