BDBM133803 US8846699, 121
SMILES: CC(=O)NCCOc1cc2ncnc(Nc3cc(Cl)c(Cl)cc3F)c2cc1NC(=O)C=C
InChI Key: InChIKey=TZDAEWGVZVGBPE-UHFFFAOYSA-N
Data: 2 IC50
Activity Spreadsheet -- Enzyme Inhibition Constant Data from BindingDB
Found 2 hits for monomerid = 133803
Trg + Lig
Ki
nM
ΔG°
kcal/mole
IC50
nM
Kd
nM
EC50/IC50
nM
koff
s-1
kon
M-1s-1
pHTemp
°C
Epidermal growth factor receptor
(Homo sapiens (Human))
BDBM133803
(US8846699, 121)
Show SMILES CC(=O)NCCOc1cc2ncnc(Nc3cc(Cl)c(Cl)cc3F)c2cc1NC(=O)C=C
Show InChI InChI=1S/C21H18Cl2FN5O3/c1-3-20(31)28-18-6-12-16(9-19(18)32-5-4-25-11(2)30)26-10-27-21(12)29-17-8-14(23)13(22)7-15(17)24/h3,6-10H,1,4-5H2,2H3,(H,25,30)(H,28,31)(H,26,27,29)
US Patent
n/an/a 5n/an/an/an/a7.425
Hanmi Pharm. Co., Ltd.
US Patent
Assay Description
EGFR1 (HER-1) enzyme assay was carried out by using Tyrosine Kinase Assay Kit Green. The entire assay was conducted in accordance with EGFR PTK inhib...
US Patent US8846699 (2014)
BindingDB Entry DOI: 10.7270/Q2KW5DRK
Vascular endothelial growth factor receptor 2
(Homo sapiens (Human))
BDBM133803
(US8846699, 121)
Show SMILES CC(=O)NCCOc1cc2ncnc(Nc3cc(Cl)c(Cl)cc3F)c2cc1NC(=O)C=C
Show InChI InChI=1S/C21H18Cl2FN5O3/c1-3-20(31)28-18-6-12-16(9-19(18)32-5-4-25-11(2)30)26-10-27-21(12)29-17-8-14(23)13(22)7-15(17)24/h3,6-10H,1,4-5H2,2H3,(H,25,30)(H,28,31)(H,26,27,29)
NCI pathway
Reactome pathway
US Patent
n/an/a 153n/an/an/an/a7.425
Hanmi Pharm. Co., Ltd.
US Patent
Assay Description
VEGFR2 (KDR, Proquinase) enzyme assay (auto-phosphorylation assay) was carried out by using Tyrosine Kinase Assay Kit Green (Panvera). The entire ass...
US Patent US8846699 (2014)
BindingDB Entry DOI: 10.7270/Q2KW5DRK