BDBM134087 US8846689, 89
SMILES: COc1cc(ccc1Nc1ncc(Cl)c(Oc2cccc3C(C)N(C)C(=O)c23)n1)N1CCN(C)CC1
InChI Key: InChIKey=HHLIJCUITFLYJM-UHFFFAOYSA-N
Data: 1 IC50
Activity Spreadsheet -- Enzyme Inhibition Constant Data from BindingDB
Found 1 hit for monomerid = 134087
Trg + Lig
Ki
nM
ΔG°
kcal/mole
IC50
nM
Kd
nM
EC50/IC50
nM
koff
s-1
kon
M-1s-1
pHTemp
°C
Focal adhesion kinase 1
(Homo sapiens (Human))
BDBM134087
(US8846689, 89)
Show SMILES COc1cc(ccc1Nc1ncc(Cl)c(Oc2cccc3C(C)N(C)C(=O)c23)n1)N1CCN(C)CC1
Show InChI InChI=1S/C26H29ClN6O3/c1-16-18-6-5-7-21(23(18)25(34)32(16)3)36-24-19(27)15-28-26(30-24)29-20-9-8-17(14-22(20)35-4)33-12-10-31(2)11-13-33/h5-9,14-16H,10-13H2,1-4H3,(H,28,29,30)
NCI pathway
Reactome pathway
US Patent
n/an/a 1n/an/an/an/a7.5n/a
Boehringer Ingelheim International GmbH
US Patent
Assay Description
This test uses active PTK2 enzyme (Invitrogen Code PV3832) and poly-Glu-Tyr (4:1, Sigma P-0275) as the kinase substrate. The kinase activity is detec...
US Patent US8846689 (2014)
BindingDB Entry DOI: 10.7270/Q2BC3X7Z