BDBM134090 US8846689, 92
SMILES: COc1cc(C(=O)NC2CCN(C)CC2)c(Cl)cc1Nc1ncc(Cl)c(Oc2cccc3CN(C)C(=O)c23)n1
InChI Key: InChIKey=UBVPWLAGRJRZEM-UHFFFAOYSA-N
Data: 1 IC50
Activity Spreadsheet -- Enzyme Inhibition Constant Data from BindingDB
Found 1 hit for monomerid = 134090
Trg + Lig
Ki
nM
ΔG°
kcal/mole
IC50
nM
Kd
nM
EC50/IC50
nM
koff
s-1
kon
M-1s-1
pHTemp
°C
Focal adhesion kinase 1
(Homo sapiens (Human))
BDBM134090
(US8846689, 92)
Show SMILES COc1cc(C(=O)NC2CCN(C)CC2)c(Cl)cc1Nc1ncc(Cl)c(Oc2cccc3CN(C)C(=O)c23)n1
Show InChI InChI=1S/C27H28Cl2N6O4/c1-34-9-7-16(8-10-34)31-24(36)17-11-22(38-3)20(12-18(17)28)32-27-30-13-19(29)25(33-27)39-21-6-4-5-15-14-35(2)26(37)23(15)21/h4-6,11-13,16H,7-10,14H2,1-3H3,(H,31,36)(H,30,32,33)
NCI pathway
Reactome pathway
US Patent
n/an/a 1n/an/an/an/a7.5n/a
Boehringer Ingelheim International GmbH
US Patent
Assay Description
This test uses active PTK2 enzyme (Invitrogen Code PV3832) and poly-Glu-Tyr (4:1, Sigma P-0275) as the kinase substrate. The kinase activity is detec...
US Patent US8846689 (2014)
BindingDB Entry DOI: 10.7270/Q2BC3X7Z